{"text_format":"1","workbook":"xlsx","n_sheets":4,"sheets":["SRP","Einzelergebnis","Klassenergebnis","EXPORT"],"not_rendered":{"charts":3,"images":2,"macros":1,"external_links":0,"defined_names":8,"comments":0,"pivot_tables":0},"unopened":[],"bounds":{"document_bytes":16777216,"sheet_cells":100000,"rows_first":2000,"rows_last":500,"rows_between":2000,"halvings":0,"cell_chars":16384,"cell_head_chars":4096},"cells_cut":0,"cells_raw":0,"read":"whole","date_system":"1900"}

{"sheet":"SRP","index":0,"n_rows":55,"n_cols":47,"rows_kept":55,"cut":false,"hidden":false,"merged":[[14,1,15,3],[30,46,30,49],[31,46,31,49],[13,46,17,49],[19,46,19,49],[20,46,20,49],[21,46,21,49],[22,46,22,49],[21,37,21,44],[22,37,22,44],[28,37,28,44],[19,37,19,44],[20,37,20,44],[23,46,23,49],[24,46,24,49],[25,46,25,49],[26,46,26,49],[27,46,27,49],[28,46,28,49],[29,46,29,49],[23,37,23,44],[12,1,13,1],[10,4,15,4],[10,5,15,5],[32,46,32,49],[33,46,33,49],[52,46,52,49],[53,46,53,49],[54,46,54,49],[43,46,43,49],[44,46,44,49],[45,46,45,49],[46,46,46,49],[47,46,47,49],[48,46,48,49],[49,46,49,49],[50,46,50,49],[51,46,51,49],[36,46,36,49],[37,46,37,49],[38,46,38,49],[39,46,39,49],[40,46,40,49],[41,46,41,49],[42,46,42,49],[34,46,34,49],[35,46,35,49],[10,6,15,6],[7,12,8,15],[8,24,8,27],[10,17,15,17],[9,4,9,7],[9,8,9,11],[10,15,15,15],[10,7,15,7],[10,16,15,16],[9,27,17,27],[10,8,15,8],[10,18,15,18],[10,19,15,19],[10,20,15,20],[10,21,15,21],[10,22,15,22],[10,23,15,23],[10,14,15,14],[7,24,7,27],[7,16,8,23],[10,2,11,3],[4,1,4,27],[7,4,8,7],[7,8,8,11],[9,12,9,15],[6,4,6,7],[6,8,6,11],[6,12,6,15],[9,16,9,19],[9,20,9,23],[6,16,6,19],[6,20,6,23],[6,2,6,3],[9,2,9,3],[9,24,17,24],[9,25,17,25],[9,26,17,26],[10,9,15,9],[10,10,15,10],[10,11,15,11],[10,12,15,12],[10,13,15,13],[12,2,13,3],[10,1,11,1],[37,37,37,44],[38,37,38,44],[29,37,29,44],[30,37,30,44],[31,37,31,44],[32,37,32,44],[33,37,33,44],[9,30,17,30],[9,31,17,31],[9,32,17,32],[13,37,17,44],[27,37,27,44],[26,37,26,44],[25,37,25,44],[24,37,24,44],[34,37,34,44],[16,1,16,3],[2,1,2,3],[54,37,54,44],[49,37,49,44],[50,37,50,44],[51,37,51,44],[52,37,52,44],[53,37,53,44],[2,24,2,32],[2,5,2,22],[44,37,44,44],[45,37,45,44],[46,37,46,44],[47,37,47,44],[48,37,48,44],[39,37,39,44],[40,37,40,44],[41,37,41,44],[42,37,42,44],[43,37,43,44],[7,2,8,3],[7,1,8,1],[35,37,35,44],[36,37,36,44]]}
[]
[null,"Version 1.1"]
[null,"Bitte beachten Sie folgende Hinweise:",null,null,null,"1) Bitte Fremdsprache weiter unten im Dropdown-Menü auswählen und die Schulkennzahl und Klasse eintragen.\n2) Für die Fertigkeiten Lesen, Hören und Sprachverwendung im Kontext bitte für jede Aufgabe die maximal zu erreichenden Punkte in die orangen Felder eintragen.\n3) Tragen Sie für alle Kandidatinnen und Kandidaten Name, Geschlecht, besuchte Schulform und erreichte Punkte pro Aufgabe ein. Beachten Sie dabei bitte, dass für nicht gelöste bzw. nicht bearbeitete Aufgaben der Wert 0 eingetragen werden muss. Achtung: Werden für eine Fertigkeit gar keine Werte eingetragen, wird diese bei der Berechnung nicht berücksichtigt.\n4) Tragen Sie bitte die laut Beurteilungserlass (AHS, GZ BMBF-11.012/0250-I/3/2014) ermittelte Note (als Ziffer) für jede Kandidatin und jeden Kandidaten ein.",null,null,null,null,null,null,null,null,null,null,null,null,null,null,null,null,null,null,"5) Verfassen Sie bitte eine verbale Begründung für jede Note.\n6) Sind die Ergebnisse aller Kandidatinnen und Kandidaten eingetragen, klicken Sie bitte auf den Button \"Daten exportieren (anonym)\".\n7) Unten links können Sie unter \"Einzelergebnis\" bzw. \"Klassenergebnis\" detaillierte Ergebnisse zu jeder Kandidatin und jedem Kandidaten bzw. von der ganzen Gruppe sehen. Diese können auch ausgedruckt werden."]
[]
[null,"Standardisierte kompetenzorientierte schriftliche Reifeprüfung Lebende Fremdsprachen  – Mai 2016"]
[]
[null,"Kandidatenzahl",{"$f":"IF(COUNTA(E20:E55)>0,COUNTA(E20:E55),0)","v":22},null,"Lesen",null,null,null,"Hören",null,null,null,"Sprachverwendung \nim Kontext",null,null,null,"Schreiben 1",null,null,null,"Schreiben 2"]
[null,null,"Wertigkeit",null,{"$f":"25/SUM(E17:H17)","v":1.0416666666666667},null,null,null,{"$f":"25/SUM(I17:L17)","v":0.83333333333333337},null,null,null,{"$f":"25/SUM(M17:P17)","v":0.56818181818181823},null,null,null,{"$f":"25/SUM(Q17:X17)","v":0.3125},null,null,null,null,null,null,null,"gewichtete Punktsumme"]
[null,null,null,null,null,null,null,null,null,null,null,null,null,null,null,null,null,null,null,null,null,null,null,null,"(max. 25 je Fertigkeit)"]
[null,"Schulkennzahl",601256,null,"Lesen",null,null,null,"Hören",null,null,null,"Sprachverwendung \nim Kontext",null,null,null,"Schreiben 1",null,null,null,"Schreiben 2",null,null,null,"Lesen","Hören","Sprachverwendung im Kontext","Schreiben",null,null,"Rezeptiv (Lesen und Hören)","Produktiv \n(Sprachverwendung im Kontext und Schreiben)","Leistung Gesamt"]
[null,"Fremdsprache","Englisch 8-jährig",null,"Aufgabe 1","Aufgabe 2","Aufgabe 3","Aufgabe 4","Aufgabe 1","Aufgabe 2","Aufgabe 3","Aufgabe 4","Aufgabe 1","Aufgabe 2","Aufgabe 3","Aufgabe 4","Erfüllung der Aufgabenstellung","Aufbau und Layout","Spektrum sprachlicher Mittel","Sprachrichtigkeit","Erfüllung der Aufgabenstellung","Aufbau und Layout","Spektrum sprachlicher Mittel","Sprachrichtigkeit"]
[]
[null,"Klasse","8b"]
[null,null,null,null,null,null,null,null,null,null,null,null,null,null,null,null,null,null,null,null,null,null,null,null,null,null,null,null,null,null,null,null,null,null,null,null,null,"Note eintragen \ngem. Beurteilungserlass AHS\n(GZ BMBF-11.012/0250-I/3/2014)",null,null,null,null,null,null,null,null,"Fügen Sie hier die verbale Begründung für die Note ein"]
[]
[]
[null,"max. Anzahl an Punkten je Aufgabe",null,null,6,6,6,6,7,7,7,9,11,11,13,9,10,10,10,10,10,10,10,10]
[null,"Kandidatenname","Geschlecht","Schulform"]
[]
[1,"Esterbauer Sophie","w","RG",6,5,6,6,7,7,7,9,11,11,13,9,10,10,10,10,10,10,10,10,{"$f":"IF(SUMPRODUCT(N(E20:H20<>\"\"))=0,\"\",SUM(E20:H20)*$E$8)","v":23.958333333333336},{"$f":"IF(SUMPRODUCT(N(I20:L20<>\"\"))=0,\"\",SUM(I20:L20)*$I$8)","v":25},{"$f":"IF(SUMPRODUCT(N(M20:P20<>\"\"))=0,\"\",SUM(M20:P20)*$M$8)","v":25.000000000000004},{"$f":"IF(SUMPRODUCT(N(Q20:X20<>\"\"))=0,\"\",SUM(Q20:X20)*$Q$8)","v":25},null,null,{"$f":"IF(SUMPRODUCT(N(Y20:Z20<>\"\"))=0,\"\",IF($Z20=\"\",(Y20*2),(Y20+Z20)))","v":48.958333333333336},{"$f":"IF(SUMPRODUCT(N(AA20:AB20<>\"\"))=0,\"\",(AA20+AB20))","v":50},{"$f":"IF(SUMPRODUCT(N(AE20:AF20<>\"\"))=0,\"\",(AE20+AF20))","v":98.958333333333343},null,null,null,null,1,null,null,null,null,null,null,null,null,"Alle Teilbereiche WEIT über das geforderte Maß erfüllt. Sehr flüssiger, idiomatischer Ausdruck, Weit über B2."]
[2,"Fernandez de Retana Lucas","m","RG",6,6,6,6,7,7,7,9,11,11,10,7,8,9,7,7,4,6,6,6,{"$f":"IF(SUMPRODUCT(N(E21:H21<>\"\"))=0,\"\",SUM(E21:H21)*$E$8)","v":25},{"$f":"IF(SUMPRODUCT(N(I21:L21<>\"\"))=0,\"\",SUM(I21:L21)*$I$8)","v":25},{"$f":"IF(SUMPRODUCT(N(M21:P21<>\"\"))=0,\"\",SUM(M21:P21)*$M$8)","v":22.15909090909091},{"$f":"IF(SUMPRODUCT(N(Q21:X21<>\"\"))=0,\"\",SUM(Q21:X21)*$Q$8)","v":16.5625},null,null,{"$f":"IF(SUMPRODUCT(N(Y21:Z21<>\"\"))=0,\"\",IF($Z21=\"\",(Y21*2),(Y21+Z21)))","v":50},{"$f":"IF(SUMPRODUCT(N(AA21:AB21<>\"\"))=0,\"\",(AA21+AB21))","v":38.721590909090907},{"$f":"IF(SUMPRODUCT(N(AE21:AF21<>\"\"))=0,\"\",(AE21+AF21))","v":88.721590909090907},null,null,null,null,2,null,null,null,null,null,null,null,null,"In den rezeptiven Kompetenzen sehr sicher und weit  über das geforderte Maß erreicht. Im produktiven Bereich führt begrenzter Wortschatz zu Fehlern und oft ungenauem Ausdruck. Im Bereich Schreiben große Schwächen im Inhalt  und zahlreiche Fehler. "]
[3,"Frantz Moritz","m","RG",6,6,6,6,7,5,7,9,11,11,13,8,10,9,9,8,8,8,8,8,25,23.333333333333336,24.431818181818183,21.25,null,null,48.333333333333336,45.681818181818187,94.01515151515153,null,null,null,null,1,null,null,null,null,null,null,null,null,"Sowohl die produktiven wie auch die Rezeptiven Fertigkeiten sehr sicher. Kleine Fehler im Ausdruck, die aber nie verständnisstörend sind."]
[4,"Greimel Elisabeth","w","RG",6,6,6,6,7,6,7,9,10,11,13,6,8,9,7,5,9,9,8,7,{"$f":"IF(SUMPRODUCT(N(E23:H23<>\"\"))=0,\"\",SUM(E23:H23)*$E$8)","v":25},{"$f":"IF(SUMPRODUCT(N(I23:L23<>\"\"))=0,\"\",SUM(I23:L23)*$I$8)","v":24.166666666666668},{"$f":"IF(SUMPRODUCT(N(M23:P23<>\"\"))=0,\"\",SUM(M23:P23)*$M$8)","v":22.72727272727273},{"$f":"IF(SUMPRODUCT(N(Q23:X23<>\"\"))=0,\"\",SUM(Q23:X23)*$Q$8)","v":19.375},null,null,49.166666666666671,42.102272727272734,91.268939393939405,null,null,null,null,1,null,null,null,null,null,null,null,null,"Die rezeptiven Fertigkeiten sehr sicher und weit über das geforderte Maß erfüllt. Im Bereich \"Sprache im Kontext\" sehr sicher mit wenigen kleinen Fehlern. Im Bereich \"Schreiben\" gute inhaltliche Bearbeitung der Themen aber einige Unsicherheiten in der Wortwahl und Grammatik."]
[5,"Gschiel Daniel","m","RG",6,6,6,6,7,6,7,9,11,11,11,6,7,8,7,7,6,6,7,7,25,24.166666666666668,22.15909090909091,17.1875,null,null,49.166666666666671,39.346590909090907,88.513257575757578,null,null,null,null,2,null,null,null,null,null,null,null,null,"Die rezeptiven Fertigkeiten sehr sicher und weit über das geforderte Maß erfüllt. In den produktiven Fertigkeiten einige Unsicherheiten in der Wortwahl , Sprachrichtigkeit und im Bezug auf den Textaufbau."]
[6,"Hamminger Laura","w","RG",6,6,6,6,7,6,7,9,10,11,11,8,10,10,10,10,10,10,10,10,25,24.166666666666668,22.72727272727273,25,null,null,49.166666666666671,47.727272727272734,96.893939393939405,null,null,null,null,1,null,null,null,null,null,null,null,null,"Alle Teilbereiche sehr gut, idiomatischer,flüssiger Ausdruck, weit über das geforderte Maß erfüllt."]
[7,"Hernady Anna","w","RG",6,6,6,6,7,7,7,9,8,11,12,9,9,10,9,8,9,9,9,8,25,25,22.72727272727273,22.1875,null,null,50,44.914772727272734,94.914772727272734,null,null,null,null,1,null,null,null,null,null,null,null,null,"Alle Teilbereiche  weit  über das geforderte Maß erfüllt. Sicherer , idiomatischer Ausdruck mit ein paar kleinen Fehlern."]
[8,"Hois Benjamin","m","RG",6,6,6,6,7,7,7,9,10,11,12,9,9,10,10,10,8,10,10,10,25,25,23.863636363636367,24.0625,null,null,50,47.926136363636367,97.926136363636374,null,null,null,null,1,null,null,null,null,null,null,null,null,"In allen Teilbereichen ausgezeichnet, klare, idiomatische Ausdrucksweise, hohe Sicherheit in der Sprachverwendung.Alle Fertigkeiten weit über das geforderte Maß erreicht."]
[9,"Höller Pauline","w","RG",6,6,6,6,7,6,6,8,9,10,11,7,8,8,8,7,7,6,7,6,25,22.5,21.022727272727273,17.8125,null,null,47.5,38.835227272727273,86.33522727272728,null,null,null,null,2,null,null,null,null,null,null,null,null,"Die rezeptiven Fertigkeiten mit sehr großer Sicherheit erfüllt, in der Produktion inhaltlich fast vollständig aber einige Fehler und Einschränkungen im Wortschatz."]
[10,"Isailovic Emilia","w","RG",6,6,5,6,7,7,6,9,11,11,13,9,10,10,10,10,10,10,10,10,23.958333333333336,24.166666666666668,25.000000000000004,25,null,null,{"$f":"IF(SUMPRODUCT(N(Y29:Z29<>\"\"))=0,\"\",IF($Z29=\"\",(Y29*2),(Y29+Z29)))","v":48.125},{"$f":"IF(SUMPRODUCT(N(AA29:AB29<>\"\"))=0,\"\",(AA29+AB29))","v":50},98.125,null,null,null,null,1,null,null,null,null,null,null,null,null,"Alle Bereiche weit über das geforderte Maß erfüllt. Weit über B2 Niveau in allen Teilbereichen."]
[11,"Kobierski Carolin","w","RG",6,6,6,6,7,7,6,9,11,11,11,9,7,8,8,8,10,10,9,8,25,24.166666666666668,23.863636363636367,21.25,null,null,49.166666666666671,45.113636363636367,94.280303030303031,null,null,null,null,1,null,null,null,null,null,null,null,null,"Alle Teilbereiche weit über das erforderliche Ausmaß erreicht, sichere, idiomatische Sprachverwendung mit ein paar unwesentlichen Fehlern."]
[12,"Majcen Lena","w","RG",6,6,6,6,6,7,7,9,10,11,13,9,7,5,5,4,6,6,5,4,25,24.166666666666668,24.431818181818183,13.125,null,null,49.166666666666671,37.556818181818187,86.723484848484858,null,null,null,null,2,null,null,null,null,null,null,null,null,"In den rezeptiven Fertigkeiten sehr sicher und weit über das erforderliche Maß erfüllt. Auch der Bereich \"Sprache im Kontext\" mit großer Sicherheit sehr gut erfüllt. Im Bereich \"Schreiben\" große Schwächen: Wenig Sachkenntnis um gute Argumente zu finden, sehr verwirrend und unorganisiert, falsche Verwendung der link-words und Zeiten führt zu vielen Missverständnissen, eingeschränkter Wortschatz führt zu unidiomatischen, schwer verständlichen Umschreibungen. Viele Fehler.  "]
[13,"Ohersthaller Viktor","m","RG",6,6,6,5,7,6,7,9,11,10,12,7,10,10,10,10,10,10,10,7,23.958333333333336,24.166666666666668,22.72727272727273,24.0625,null,null,48.125,46.789772727272734,94.914772727272734,null,null,null,null,1,null,null,null,null,null,null,null,null,"alle Teilbereiche sehr sicher und weit über das Wesentliche erfüllt. Eindeutüg über B2."]
[14,"Rieckh Sophie","w","RG",6,6,6,6,7,7,6,9,11,11,11,9,9,10,10,9,8,10,9,8,25,24.166666666666668,23.863636363636367,22.8125,null,null,49.166666666666671,46.676136363636367,95.842803030303031,null,null,null,null,1,null,null,null,null,null,null,null,null,"Alle Teilbereiche sehr sicher und weit über das Wesentliche erfüllt. Sehr flüssiger Schreibstiel, kleine aber nie sinnstörende Fehler im Schreibteil."]
[15,"Sandner Benedikt","m","RG",6,5,6,5,7,7,5,9,9,9,8,5,5,6,6,6,5,5,6,6,22.916666666666668,23.333333333333336,17.613636363636367,14.0625,null,null,46.25,31.676136363636367,77.926136363636374,null,null,null,null,3,null,null,null,null,null,null,null,null,"In den rezeptiven Fertigkeiten sehr sicher. Die Erfordernisse in den prodiktiven Fertigkeiten im Wesentlichen erreicht aber viele Unsicherheiten und häufige Fehler."]
[16,"Schweighofer Tessa","w","RG",6,6,6,6,7,7,7,9,9,11,12,9,9,9,7,6,6,5,5,5,25,25,23.295454545454547,16.25,null,null,50,39.545454545454547,89.545454545454547,null,null,null,null,2,null,null,null,null,null,null,null,null,"Die rezeptiven Fertigkeiten sehr sicher und weit über das geforderte Maß erfüllt. Im Bereich \"Sprache im Kontext\" sehr sicher mit wenigen kleinen Fehlern. Im Bereich \"Schreiben\" teilweise  gute inhaltliche Bearbeitung der Themen aber große Unsicherheiten in der Wortwahl und Grammatik."]
[17,"Schwentner Rosa","w","RG",6,6,6,5,7,6,7,8,8,11,11,7,5,5,6,6,5,6,6,6,23.958333333333336,23.333333333333336,21.022727272727273,14.0625,null,null,47.291666666666671,35.085227272727273,82.376893939393938,null,null,null,null,2,null,null,null,null,null,null,null,null,"In den rezeptiven Fertigkeiten sehr sicher. In den produktiven Fertigkeiten das Wesentliche erreicht, allerdings viele Fehler und Einschränkungen im Ausdruck."]
[18,"Spiess Konstantin","m","RG",6,6,6,6,7,6,7,9,11,11,13,9,9,9,8,8,8,8,8,8,25,24.166666666666668,25.000000000000004,20.625,null,null,49.166666666666671,45.625,94.791666666666671,null,null,null,null,1,null,null,null,null,null,null,null,null,"Alle Teilbereiche weit über das erforderliche Ausmaß erreicht, sichere, großteils idiomatische Sprachverwendung mit ein paar unwesentlichen Fehlern."]
[19,"Tafner Hanna","w","RG",6,6,6,6,7,7,6,9,5,7,9,3,8,7,7,7,6,6,6,6,25,24.166666666666668,13.636363636363637,16.5625,null,null,49.166666666666671,30.198863636363637,79.365530303030312,null,null,null,null,3,null,null,null,null,null,null,null,null,"Die Aufgaben der rezeptiven Fertigkeiten vollständig richtig gelöst. In den produktiven Fertigkeiten Schwächen im klaren Ausdruck inhaltlicher Konzepte. Sehr ungenaue Argumentationsweise, eingeschränkter Wortschatz und zahlreiche Fehler."]
[20,"Wardell Charis","w","RG",4,6,6,6,7,7,7,9,11,11,13,9,10,10,9,8,8,10,10,10,22.916666666666668,25,25.000000000000004,23.4375,null,null,47.916666666666671,48.4375,96.354166666666671,null,null,null,null,1,null,null,null,null,null,null,null,null,"Sehr sicher in allen Teilbereichen, sowohl rezeptive als auch produktive Fertigkeiten weit über das geforderte Maß erreicht. Idiomatischer Ausdruck, sehr hohe Sprachrichtigkeit und sehr gut strukturierte, klare Argumentationslinien."]
[21,"Wasserfaller Caterina","w","RG",6,6,6,6,7,7,6,9,11,11,12,9,8,10,8,8,6,8,8,8,25,24.166666666666668,24.431818181818183,20,null,null,49.166666666666671,44.431818181818187,93.598484848484858,null,null,null,null,1,null,null,null,null,null,null,null,null,"Die rezeptiven Fertigkeiten vollständig erfüllt, in den produktiven Fertigkeiten sehr sichere, meist idiomatische Sprachverwendung. Inhaltliche Schwächen im Aufsatz aufgrund mangelnder Kenntnis der Sachlage."]
[22,"Wunderling Benjamin","m","RG",6,6,6,6,7,7,7,9,11,11,13,7,10,10,10,10,10,10,10,10,25,25,23.863636363636367,25,null,null,50,48.863636363636367,98.863636363636374,null,null,null,null,1,null,null,null,null,null,null,null,null,"In allen Teilbereichen weit über das Wesentliche erfüllt. Sehr eigenständige, idiomatische und klar strukturierte Textproduktion"]
[23,null,null,null,null,null,null,null,null,null,null,null,null,null,null,null,null,null,null,null,null,null,null,null,"","","","",null,null,"","",""]
[24,null,null,null,null,null,null,null,null,null,null,null,null,null,null,null,null,null,null,null,null,null,null,null,"","","","",null,null,"","",""]
[25,null,null,null,null,null,null,null,null,null,null,null,null,null,null,null,null,null,null,null,null,null,null,null,"","","","",null,null,"","",""]
[26,null,null,null,null,null,null,null,null,null,null,null,null,null,null,null,null,null,null,null,null,null,null,null,"","","","",null,null,"","",""]
[27,null,null,null,null,null,null,null,null,null,null,null,null,null,null,null,null,null,null,null,null,null,null,null,"","","","",null,null,"","",""]
[28,null,null,null,null,null,null,null,null,null,null,null,null,null,null,null,null,null,null,null,null,null,null,null,"","","","",null,null,"","",""]
[29,null,null,null,null,null,null,null,null,null,null,null,null,null,null,null,null,null,null,null,null,null,null,null,"","","","",null,null,"","",""]
[30,null,null,null,null,null,null,null,null,null,null,null,null,null,null,null,null,null,null,null,null,null,null,null,"","","","",null,null,"","",""]
[31,null,null,null,null,null,null,null,null,null,null,null,null,null,null,null,null,null,null,null,null,null,null,null,"","","","",null,null,"","",""]
[32,null,null,null,null,null,null,null,null,null,null,null,null,null,null,null,null,null,null,null,null,null,null,null,"","","","",null,null,"","",""]
[33,null,null,null,null,null,null,null,null,null,null,null,null,null,null,null,null,null,null,null,null,null,null,null,"","","","",null,null,"","",""]
[34,null,null,null,null,null,null,null,null,null,null,null,null,null,null,null,null,null,null,null,null,null,null,null,"","","","",null,null,"","",""]
[35,null,null,null,null,null,null,null,null,null,null,null,null,null,null,null,null,null,null,null,null,null,null,null,"","","","",null,null,"","",""]
[36,null,null,null,null,null,null,null,null,null,null,null,null,null,null,null,null,null,null,null,null,null,null,null,"","","","",null,null,"","",""]

{"sheet":"Einzelergebnis","index":1,"n_rows":38,"n_cols":15,"rows_kept":38,"cut":false,"hidden":false,"merged":[[13,6,14,7],[13,8,14,8],[11,6,11,7],[17,6,33,10],[4,11,5,11],[4,9,5,9],[16,6,16,10],[9,1,10,2],[2,1,7,2],[6,8,7,8],[8,8,9,8],[4,6,5,6],[4,7,5,7],[4,8,5,8],[8,4,9,4],[4,4,5,4],[4,5,5,5],[6,4,7,4]]}
[]
[null,null,null,null,null,null,null,null,null,null,null,null,null,null,"lf Nr."]
[null,"Einzelauswertungen\nGewünschte Kandidatin/ gewünschten Kandidat\nauswählen",null,null,null,"Reifeprüfungsergebnis von:",{"$f":"B10","v":"Schwentner Rosa"},null,null,null,null,null,null,null,{"$f":"IF(SRP!B20<>\"\",ROW(O3)-2,\"\")","v":1}]
[null,null,null,null,null,null,null,null,null,null,null,null,null,null,{"$f":"IF(SRP!B21<>\"\",ROW(O4)-2,\"\")","v":2}]
[null,null,null,null,"Kompetenzbereiche","Fertigkeit","Punkte","gewichtete Punkte","gewichtete Punkte pro \nKompetenzbereich","Lösungs-quote in %",null,"LqK in % (Klassen-mittelwert)",null,null,{"$f":"IF(SRP!B22<>\"\",ROW(O5)-2,\"\")","v":3}]
[null,null,null,null,null,null,null,null,null,null,null,null,null,null,{"$f":"IF(SRP!B23<>\"\",ROW(O6)-2,\"\")","v":4}]
[null,null,null,null,"rezeptiver Kompetenzbereich","Lesen",{"$f":"SUM(INDIRECT(\"SRP!\"&\"E\"&SUM($C$9+19)):INDIRECT(\"SRP!\"&\"H\"&SUM($C$9+19)))","v":23},{"$f":"INDIRECT(\"SRP!\"&\"Y\"&SUM($C$9+19))","v":23.958333333333336},{"$f":"INDIRECT(\"SRP!\"&\"AE\"&SUM($C$9+19))","v":47.291666666666671},{"$f":"IF(SUMPRODUCT(N(H7<>\"\"))=0,\"\",ROUND(H7/25*100,2) )","v":95.83},null,{"$f":"IF(SUMPRODUCT(N(SRP!Y20:Y55<>\"\"))=0,\"\",ROUND(AVERAGE(SRP!Y20:Y55)*4,2))","v":98.48},null,null,{"$f":"IF(SRP!B24<>\"\",ROW(O7)-2,\"\")","v":5}]
[null,null,null,null,null,"Hören",{"$f":"IF(COUNTA(INDIRECT(\"SRP!\"&\"I\"&SUM($C$9+19)):INDIRECT(\"SRP!\"&\"L\"&SUM($C$9+19)))=0,\"\",SUM(INDIRECT(\"SRP!\"&\"I\"&SUM($C$9+19)):INDIRECT(\"SRP!\"&\"L\"&SUM($C$9+19))))","v":28},{"$f":"INDIRECT(\"SRP!\"&\"Z\"&SUM($C$9+19))","v":23.333333333333336},null,{"$f":"IF(SUMPRODUCT(N(H8<>\"\"))=0,\"\",ROUND(H8/25*100,2) )","v":93.33},null,{"$f":"IF(SUMPRODUCT(N(SRP!Z20:Z55<>\"\"))=0,\"\",ROUND(AVERAGE(SRP!Z20:Z55)*4,2))","v":96.97},null,null,{"$f":"IF(SRP!B25<>\"\",ROW(O8)-2,\"\")","v":6}]
[null,"Kandidat/in",17,null,"produktiver Kompetenzbereich","Sprache im Kontext",{"$f":"SUM(INDIRECT(\"SRP!\"&\"M\"&SUM($C$9+19)):INDIRECT(\"SRP!\"&\"P\"&SUM($C$9+19)))","v":37},{"$f":"INDIRECT(\"SRP!\"&\"AA\"&SUM($C$9+19))","v":21.022727272727273},{"$f":"INDIRECT(\"SRP!\"&\"AF\"&SUM($C$9+19))","v":35.085227272727273},{"$f":"IF(SUMPRODUCT(N(H9<>\"\"))=0,\"\",ROUND(H9/25*100,2) )","v":84.09},null,{"$f":"IF(SUMPRODUCT(N(SRP!AA20:AA55<>\"\"))=0,\"\",ROUND(AVERAGE(SRP!AA20:AA55)*4,2))","v":91.01},null,null,{"$f":"IF(SRP!B26<>\"\",ROW(O9)-2,\"\")","v":7}]
[null,{"$f":"IF(INDIRECT(\"SRP!\"&\"B\"&Einzelergebnis!C9+19)<>0,INDIRECT(\"SRP!\"&\"B\"&Einzelergebnis!C9+19),\"\")","v":"Schwentner Rosa"},null,null,null,"Schreiben",{"$f":"SUM(INDIRECT(\"SRP!\"&\"Q\"&SUM($C$9+19)):INDIRECT(\"SRP!\"&\"X\"&SUM($C$9+19)))","v":45},{"$f":"INDIRECT(\"SRP!\"&\"AB\"&SUM($C$9+19))","v":14.0625},null,56.25,null,{"$f":"IF(SUMPRODUCT(N(SRP!AB20:AB55<>\"\"))=0,\"\",ROUND(AVERAGE(SRP!AB20:AB55)*4,2))","v":80.849999999999994},null,null,{"$f":"IF(SRP!B27<>\"\",ROW(O10)-2,\"\")","v":8}]
[null,null,null,null,null,null,null,null,null,null,null,null,null,null,{"$f":"IF(SRP!B28<>\"\",ROW(O11)-2,\"\")","v":9}]
[null,null,null,null,null,null,"gewichtete Punkte gesamt",null,{"$f":"SUM(I7:I10)","v":82.376893939393938},null,null,null,null,null,{"$f":"IF(SRP!B29<>\"\",ROW(O12)-2,\"\")","v":10}]
[null,null,null,null,null,null,null,null,null,null,null,null,null,null,{"$f":"IF(SRP!B30<>\"\",ROW(O13)-2,\"\")","v":11}]
[null,null,null,null,null,null,"Note",null,{"$f":"LOOKUP(IF(SUMPRODUCT(N(INDIRECT(\"SRP!\"&\"AL\"&SUM($C$9+19))<>\"\"))=0,\"\",INDIRECT(\"SRP!\"&\"AL\"&SUM($C$9+19))),{1;2;3;4;5;\"\"},{\"Sehr Gut\";\"Gut\";\"Befriedigend\";\"Genügend\";\"Nicht Genügend\";\"\"})","v":"Gut"},null,null,null,null,null,{"$f":"IF(SRP!B31<>\"\",ROW(O14)-2,\"\")","v":12}]
[null,null,null,null,null,null,null,null,null,null,null,null,null,null,{"$f":"IF(SRP!B32<>\"\",ROW(O15)-2,\"\")","v":13}]
[null,null,null,null,null,null,null,null,null,null,null,null,null,null,{"$f":"IF(SRP!B33<>\"\",ROW(O16)-2,\"\")","v":14}]
[null,null,null,null,null,null,"Verbale Begründung (für Reifeprüfung verpflichtend)",null,null,null,null,null,null,null,{"$f":"IF(SRP!B34<>\"\",ROW(O17)-2,\"\")","v":15}]
[null,null,null,null,null,null,{"$f":"IF(COUNTA(INDIRECT(\"SRP!\"&\"$AU\"&SUM($C$9+19)))=0, \"\", INDIRECT(\"SRP!\"&\"$AU\"&SUM($C$9+19)))","v":"In den rezeptiven Fertigkeiten sehr sicher. In den produktiven Fertigkeiten das Wesentliche erreicht, allerdings viele Fehler und Einschränkungen im Ausdruck."},null,null,null,null,null,null,null,{"$f":"IF(SRP!B35<>\"\",ROW(O18)-2,\"\")","v":16}]
[null,null,null,null,null,null,null,null,null,null,null,null,null,null,{"$f":"IF(SRP!B36<>\"\",ROW(O19)-2,\"\")","v":17}]
[null,null,null,null,null,null,null,null,null,null,null,null,null,null,{"$f":"IF(SRP!B37<>\"\",ROW(O20)-2,\"\")","v":18}]
[null,null,null,null,null,null,null,null,null,null,null,null,null,null,{"$f":"IF(SRP!B38<>\"\",ROW(O21)-2,\"\")","v":19}]
[null,null,null,null,null,null,null,null,null,null,null,null,null,null,{"$f":"IF(SRP!B39<>\"\",ROW(O22)-2,\"\")","v":20}]
[null,null,null,null,null,null,null,null,null,null,null,null,null,null,{"$f":"IF(SRP!B40<>\"\",ROW(O23)-2,\"\")","v":21}]
[null,null,null,null,null,null,null,null,null,null,null,null,null,null,{"$f":"IF(SRP!B41<>\"\",ROW(O24)-2,\"\")","v":22}]
[null,null,null,null,null,null,null,null,null,null,null,null,null,null,{"$f":"IF(SRP!B42<>\"\",ROW(O25)-2,\"\")","v":""}]
[null,null,null,null,null,null,null,null,null,null,null,null,null,null,{"$f":"IF(SRP!B43<>\"\",ROW(O26)-2,\"\")","v":""}]
[null,null,null,null,null,null,null,null,null,null,null,null,null,null,{"$f":"IF(SRP!B44<>\"\",ROW(O27)-2,\"\")","v":""}]
[null,null,null,null,null,null,null,null,null,null,null,null,null,null,{"$f":"IF(SRP!B45<>\"\",ROW(O28)-2,\"\")","v":""}]
[null,null,null,null,null,null,null,null,null,null,null,null,null,null,{"$f":"IF(SRP!B46<>\"\",ROW(O29)-2,\"\")","v":""}]
[null,null,null,null,null,null,null,null,null,null,null,null,null,null,{"$f":"IF(SRP!B47<>\"\",ROW(O30)-2,\"\")","v":""}]
[null,null,null,null,null,null,null,null,null,null,null,null,null,null,{"$f":"IF(SRP!B48<>\"\",ROW(O31)-2,\"\")","v":""}]
[null,null,null,null,null,null,null,null,null,null,null,null,null,null,{"$f":"IF(SRP!B49<>\"\",ROW(O32)-2,\"\")","v":""}]
[null,null,null,null,null,null,null,null,null,null,null,null,null,null,{"$f":"IF(SRP!B50<>\"\",ROW(O33)-2,\"\")","v":""}]
[null,null,null,null,null,null,null,null,null,null,null,null,null,null,{"$f":"IF(SRP!B51<>\"\",ROW(O34)-2,\"\")","v":""}]
[null,null,null,null,null,null,null,null,null,null,null,null,null,null,{"$f":"IF(SRP!B52<>\"\",ROW(O35)-2,\"\")","v":""}]
[null,null,null,null,null,null,null,null,null,null,null,null,null,null,{"$f":"IF(SRP!B53<>\"\",ROW(O36)-2,\"\")","v":""}]
[null,null,null,null,null,null,null,null,null,null,null,null,null,null,{"$f":"IF(SRP!B54<>\"\",ROW(O37)-2,\"\")","v":""}]
[null,null,null,null,null,null,null,null,null,null,null,null,null,null,{"$f":"IF(SRP!B55<>\"\",ROW(O38)-2,\"\")","v":""}]

{"sheet":"Klassenergebnis","index":2,"n_rows":33,"n_cols":10,"rows_kept":33,"cut":false,"hidden":false,"merged":[[25,8,25,9],[2,1,2,15]]}
[]
[]
[null,"Klassenergebnis"]
[]
[]
[]
["Klasse für Tabelle"]
[]
[1]
[2]
[3]
[4]
[5]
[]
[]
[]
[]
[]
[]
[]
[]
[]
[]
[]
[]
[null,null,null,null,null,null,null,"Note","Häufigkeit"]
[null,null,null,null,null,null,null,null,"Anzahl","Prozent"]
[null,null,null,null,null,null,null,"Sehr Gut",{"$f":"FREQUENCY(SRP!AL20:AL55,A9:A13)","v":14},{"$f":"IF($I$33<>0,ROUND(I28/SUM($I$28:$I$32)*100,2),0)","v":63.64}]
[null,null,null,null,null,null,null,"Gut",6,{"$f":"IF($I$33<>0,ROUND(I29/SUM($I$28:$I$32)*100,2),0)","v":27.27}]
[null,null,null,null,null,null,null,"Befriedigend",2,9.09]
[null,null,null,null,null,null,null,"Genügend",0,0]
[null,null,null,null,null,null,null,"Nicht Genügend",0,0]
[null,null,null,null,null,null,null,"Kandidatenzahl",{"$f":"SUM(I28:I32)","v":22},{"$f":"SUM(J28:J32)","v":100}]

{"sheet":"EXPORT","index":3,"n_rows":38,"n_cols":33,"rows_kept":38,"cut":false,"hidden":true,"merged":[]}
["Schulform",{"$f":"SRP!B10","v":"Schulkennzahl"},"Fach","Klasse","Version","Kandidatennummer","Geschlecht","Schulform_Kand","Aufgabe_1","Aufgabe_2","Aufgabe_3","Aufgabe_4","Aufgabe_5","Aufgabe_6","Aufgabe_7","Aufgabe_8","Aufgabe_9","Aufgabe_10","Aufgabe_11","Aufgabe_12","Aufgabe_13","Aufgabe_14","Aufgabe_15","Aufgabe_16","Aufgabe_17","Aufgabe_18","Aufgabe_19","Aufgabe_20","Lesen_gew","Hoeren_gew","SiK_gew","Schreiben_gew","Note"]
["AHS",{"$f":"SRP!C10","v":601256},{"$f":"SRP!C11","v":"Englisch 8-jährig"},{"$f":"SRP!C13","v":"8b"},{"$f":"SRP!B2","v":"Version 1.1"},{"$f":"SRP!C7","v":22},null,null,{"$f":"SRP!E17","v":6},{"$f":"SRP!F17","v":6},{"$f":"SRP!G17","v":6},{"$f":"SRP!H17","v":6},{"$f":"SRP!I17","v":7},{"$f":"SRP!J17","v":7},{"$f":"SRP!K17","v":7},{"$f":"SRP!L17","v":9},{"$f":"SRP!M17","v":11},{"$f":"SRP!N17","v":11},{"$f":"SRP!O17","v":13},{"$f":"SRP!P17","v":9},{"$f":"SRP!Q17","v":10},{"$f":"SRP!R17","v":10},{"$f":"SRP!S17","v":10},{"$f":"SRP!T17","v":10},{"$f":"SRP!U17","v":10},{"$f":"SRP!V17","v":10},{"$f":"SRP!W17","v":10},{"$f":"SRP!X17","v":10},25,25,25,25]
[null,null,null,null,null,{"$f":"IF(SRP!B20<>\"\",ROW(F3)-2,\"\")","v":1},{"$f":"IF(SUMPRODUCT(N(SRP!$C20<>\"\"))=0,\"\",SRP!C20)","v":"w"},{"$f":"IF(SUMPRODUCT(N(SRP!$D20<>\"\"))=0,\"\",SRP!D20)","v":"RG"},{"$f":"IF(SUMPRODUCT(N(SRP!$E20:'SRP'!$H20<>\"\"))=0,\"\",SRP!E20)","v":6},{"$f":"IF(SUMPRODUCT(N(SRP!$E20:'SRP'!$H20<>\"\"))=0,\"\",SRP!F20)","v":5},{"$f":"IF(SUMPRODUCT(N(SRP!$E20:'SRP'!$H20<>\"\"))=0,\"\",SRP!G20)","v":6},{"$f":"IF(SUMPRODUCT(N(SRP!$E20:'SRP'!$H20<>\"\"))=0,\"\",SRP!H20)","v":6},{"$f":"IF(SUMPRODUCT(N(SRP!$I20:'SRP'!$L20<>\"\"))=0,\"\",SRP!I20)","v":7},{"$f":"IF(SUMPRODUCT(N(SRP!$I20:'SRP'!$L20<>\"\"))=0,\"\",SRP!J20)","v":7},{"$f":"IF(SUMPRODUCT(N(SRP!$I20:'SRP'!$L20<>\"\"))=0,\"\",SRP!K20)","v":7},{"$f":"IF(SUMPRODUCT(N(SRP!$I20:'SRP'!$L20<>\"\"))=0,\"\",SRP!L20)","v":9},{"$f":"IF(SUMPRODUCT(N(SRP!$M20:'SRP'!$P20<>\"\"))=0,\"\",SRP!M20)","v":11},{"$f":"IF(SUMPRODUCT(N(SRP!$M20:'SRP'!$P20<>\"\"))=0,\"\",SRP!N20)","v":11},{"$f":"IF(SUMPRODUCT(N(SRP!$M20:'SRP'!$P20<>\"\"))=0,\"\",SRP!O20)","v":13},{"$f":"IF(SUMPRODUCT(N(SRP!$M20:'SRP'!$P20<>\"\"))=0,\"\",SRP!P20)","v":9},{"$f":"IF(SUMPRODUCT(N(SRP!$Q20:'SRP'!$X20<>\"\"))=0,\"\",SRP!Q20)","v":10},{"$f":"IF(SUMPRODUCT(N(SRP!$Q20:'SRP'!$X20<>\"\"))=0,\"\",SRP!R20)","v":10},{"$f":"IF(SUMPRODUCT(N(SRP!$Q20:'SRP'!$X20<>\"\"))=0,\"\",SRP!S20)","v":10},{"$f":"IF(SUMPRODUCT(N(SRP!$Q20:'SRP'!$X20<>\"\"))=0,\"\",SRP!T20)","v":10},{"$f":"IF(SUMPRODUCT(N(SRP!$Q20:'SRP'!$X20<>\"\"))=0,\"\",SRP!U20)","v":10},{"$f":"IF(SUMPRODUCT(N(SRP!$Q20:'SRP'!$X20<>\"\"))=0,\"\",SRP!V20)","v":10},{"$f":"IF(SUMPRODUCT(N(SRP!$Q20:'SRP'!$X20<>\"\"))=0,\"\",SRP!W20)","v":10},{"$f":"IF(SUMPRODUCT(N(SRP!$Q20:'SRP'!$X20<>\"\"))=0,\"\",SRP!X20)","v":10},{"$f":"IF(SUMPRODUCT(N(SRP!Y20<>\"\"))=0,\"\",ROUND(SRP!Y20, 2))","v":23.96},{"$f":"IF(SUMPRODUCT(N(SRP!Z20<>\"\"))=0,\"\",ROUND(SRP!Z20, 2))","v":25},{"$f":"IF(SUMPRODUCT(N(SRP!AA20<>\"\"))=0,\"\",ROUND(SRP!AA20, 2))","v":25},{"$f":"IF(SUMPRODUCT(N(SRP!AB20<>\"\"))=0,\"\",ROUND(SRP!AB20, 2))","v":25},{"$f":"IF(SUMPRODUCT(N(SRP!AL20<>\"\"))=0,\"\",SRP!AL20)","v":1}]
[null,null,null,null,null,{"$f":"IF(SRP!B21<>\"\",ROW(F4)-2,\"\")","v":2},{"$f":"IF(SUMPRODUCT(N(SRP!$C21<>\"\"))=0,\"\",SRP!C21)","v":"m"},{"$f":"IF(SUMPRODUCT(N(SRP!$D21<>\"\"))=0,\"\",SRP!D21)","v":"RG"},{"$f":"IF(SUMPRODUCT(N(SRP!$E21:'SRP'!$H21<>\"\"))=0,\"\",SRP!E21)","v":6},{"$f":"IF(SUMPRODUCT(N(SRP!$E21:'SRP'!$H21<>\"\"))=0,\"\",SRP!F21)","v":6},{"$f":"IF(SUMPRODUCT(N(SRP!$E21:'SRP'!$H21<>\"\"))=0,\"\",SRP!G21)","v":6},{"$f":"IF(SUMPRODUCT(N(SRP!$E21:'SRP'!$H21<>\"\"))=0,\"\",SRP!H21)","v":6},{"$f":"IF(SUMPRODUCT(N(SRP!$I21:'SRP'!$L21<>\"\"))=0,\"\",SRP!I21)","v":7},{"$f":"IF(SUMPRODUCT(N(SRP!$I21:'SRP'!$L21<>\"\"))=0,\"\",SRP!J21)","v":7},{"$f":"IF(SUMPRODUCT(N(SRP!$I21:'SRP'!$L21<>\"\"))=0,\"\",SRP!K21)","v":7},{"$f":"IF(SUMPRODUCT(N(SRP!$I21:'SRP'!$L21<>\"\"))=0,\"\",SRP!L21)","v":9},{"$f":"IF(SUMPRODUCT(N(SRP!$M21:'SRP'!$P21<>\"\"))=0,\"\",SRP!M21)","v":11},{"$f":"IF(SUMPRODUCT(N(SRP!$M21:'SRP'!$P21<>\"\"))=0,\"\",SRP!N21)","v":11},{"$f":"IF(SUMPRODUCT(N(SRP!$M21:'SRP'!$P21<>\"\"))=0,\"\",SRP!O21)","v":10},{"$f":"IF(SUMPRODUCT(N(SRP!$M21:'SRP'!$P21<>\"\"))=0,\"\",SRP!P21)","v":7},{"$f":"IF(SUMPRODUCT(N(SRP!$Q21:'SRP'!$X21<>\"\"))=0,\"\",SRP!Q21)","v":8},{"$f":"IF(SUMPRODUCT(N(SRP!$Q21:'SRP'!$X21<>\"\"))=0,\"\",SRP!R21)","v":9},{"$f":"IF(SUMPRODUCT(N(SRP!$Q21:'SRP'!$X21<>\"\"))=0,\"\",SRP!S21)","v":7},{"$f":"IF(SUMPRODUCT(N(SRP!$Q21:'SRP'!$X21<>\"\"))=0,\"\",SRP!T21)","v":7},{"$f":"IF(SUMPRODUCT(N(SRP!$Q21:'SRP'!$X21<>\"\"))=0,\"\",SRP!U21)","v":4},{"$f":"IF(SUMPRODUCT(N(SRP!$Q21:'SRP'!$X21<>\"\"))=0,\"\",SRP!V21)","v":6},{"$f":"IF(SUMPRODUCT(N(SRP!$Q21:'SRP'!$X21<>\"\"))=0,\"\",SRP!W21)","v":6},{"$f":"IF(SUMPRODUCT(N(SRP!$Q21:'SRP'!$X21<>\"\"))=0,\"\",SRP!X21)","v":6},{"$f":"IF(SUMPRODUCT(N(SRP!Y21<>\"\"))=0,\"\",ROUND(SRP!Y21, 2))","v":25},{"$f":"IF(SUMPRODUCT(N(SRP!Z21<>\"\"))=0,\"\",ROUND(SRP!Z21, 2))","v":25},{"$f":"IF(SUMPRODUCT(N(SRP!AA21<>\"\"))=0,\"\",ROUND(SRP!AA21, 2))","v":22.16},{"$f":"IF(SUMPRODUCT(N(SRP!AB21<>\"\"))=0,\"\",ROUND(SRP!AB21, 2))","v":16.559999999999999},{"$f":"IF(SUMPRODUCT(N(SRP!AL21<>\"\"))=0,\"\",SRP!AL21)","v":2}]
[null,null,null,null,null,{"$f":"IF(SRP!B22<>\"\",ROW(F5)-2,\"\")","v":3},{"$f":"IF(SUMPRODUCT(N(SRP!$C22<>\"\"))=0,\"\",SRP!C22)","v":"m"},{"$f":"IF(SUMPRODUCT(N(SRP!$D22<>\"\"))=0,\"\",SRP!D22)","v":"RG"},{"$f":"IF(SUMPRODUCT(N(SRP!$E22:'SRP'!$H22<>\"\"))=0,\"\",SRP!E22)","v":6},{"$f":"IF(SUMPRODUCT(N(SRP!$E22:'SRP'!$H22<>\"\"))=0,\"\",SRP!F22)","v":6},{"$f":"IF(SUMPRODUCT(N(SRP!$E22:'SRP'!$H22<>\"\"))=0,\"\",SRP!G22)","v":6},{"$f":"IF(SUMPRODUCT(N(SRP!$E22:'SRP'!$H22<>\"\"))=0,\"\",SRP!H22)","v":6},{"$f":"IF(SUMPRODUCT(N(SRP!$I22:'SRP'!$L22<>\"\"))=0,\"\",SRP!I22)","v":7},{"$f":"IF(SUMPRODUCT(N(SRP!$I22:'SRP'!$L22<>\"\"))=0,\"\",SRP!J22)","v":5},{"$f":"IF(SUMPRODUCT(N(SRP!$I22:'SRP'!$L22<>\"\"))=0,\"\",SRP!K22)","v":7},{"$f":"IF(SUMPRODUCT(N(SRP!$I22:'SRP'!$L22<>\"\"))=0,\"\",SRP!L22)","v":9},{"$f":"IF(SUMPRODUCT(N(SRP!$M22:'SRP'!$P22<>\"\"))=0,\"\",SRP!M22)","v":11},{"$f":"IF(SUMPRODUCT(N(SRP!$M22:'SRP'!$P22<>\"\"))=0,\"\",SRP!N22)","v":11},{"$f":"IF(SUMPRODUCT(N(SRP!$M22:'SRP'!$P22<>\"\"))=0,\"\",SRP!O22)","v":13},{"$f":"IF(SUMPRODUCT(N(SRP!$M22:'SRP'!$P22<>\"\"))=0,\"\",SRP!P22)","v":8},{"$f":"IF(SUMPRODUCT(N(SRP!$Q22:'SRP'!$X22<>\"\"))=0,\"\",SRP!Q22)","v":10},{"$f":"IF(SUMPRODUCT(N(SRP!$Q22:'SRP'!$X22<>\"\"))=0,\"\",SRP!R22)","v":9},{"$f":"IF(SUMPRODUCT(N(SRP!$Q22:'SRP'!$X22<>\"\"))=0,\"\",SRP!S22)","v":9},{"$f":"IF(SUMPRODUCT(N(SRP!$Q22:'SRP'!$X22<>\"\"))=0,\"\",SRP!T22)","v":8},{"$f":"IF(SUMPRODUCT(N(SRP!$Q22:'SRP'!$X22<>\"\"))=0,\"\",SRP!U22)","v":8},{"$f":"IF(SUMPRODUCT(N(SRP!$Q22:'SRP'!$X22<>\"\"))=0,\"\",SRP!V22)","v":8},{"$f":"IF(SUMPRODUCT(N(SRP!$Q22:'SRP'!$X22<>\"\"))=0,\"\",SRP!W22)","v":8},{"$f":"IF(SUMPRODUCT(N(SRP!$Q22:'SRP'!$X22<>\"\"))=0,\"\",SRP!X22)","v":8},{"$f":"IF(SUMPRODUCT(N(SRP!Y22<>\"\"))=0,\"\",ROUND(SRP!Y22, 2))","v":25},{"$f":"IF(SUMPRODUCT(N(SRP!Z22<>\"\"))=0,\"\",ROUND(SRP!Z22, 2))","v":23.33},{"$f":"IF(SUMPRODUCT(N(SRP!AA22<>\"\"))=0,\"\",ROUND(SRP!AA22, 2))","v":24.43},{"$f":"IF(SUMPRODUCT(N(SRP!AB22<>\"\"))=0,\"\",ROUND(SRP!AB22, 2))","v":21.25},{"$f":"IF(SUMPRODUCT(N(SRP!AL22<>\"\"))=0,\"\",SRP!AL22)","v":1}]
[null,null,null,null,null,{"$f":"IF(SRP!B23<>\"\",ROW(F6)-2,\"\")","v":4},{"$f":"IF(SUMPRODUCT(N(SRP!$C23<>\"\"))=0,\"\",SRP!C23)","v":"w"},{"$f":"IF(SUMPRODUCT(N(SRP!$D23<>\"\"))=0,\"\",SRP!D23)","v":"RG"},{"$f":"IF(SUMPRODUCT(N(SRP!$E23:'SRP'!$H23<>\"\"))=0,\"\",SRP!E23)","v":6},{"$f":"IF(SUMPRODUCT(N(SRP!$E23:'SRP'!$H23<>\"\"))=0,\"\",SRP!F23)","v":6},{"$f":"IF(SUMPRODUCT(N(SRP!$E23:'SRP'!$H23<>\"\"))=0,\"\",SRP!G23)","v":6},{"$f":"IF(SUMPRODUCT(N(SRP!$E23:'SRP'!$H23<>\"\"))=0,\"\",SRP!H23)","v":6},{"$f":"IF(SUMPRODUCT(N(SRP!$I23:'SRP'!$L23<>\"\"))=0,\"\",SRP!I23)","v":7},{"$f":"IF(SUMPRODUCT(N(SRP!$I23:'SRP'!$L23<>\"\"))=0,\"\",SRP!J23)","v":6},{"$f":"IF(SUMPRODUCT(N(SRP!$I23:'SRP'!$L23<>\"\"))=0,\"\",SRP!K23)","v":7},{"$f":"IF(SUMPRODUCT(N(SRP!$I23:'SRP'!$L23<>\"\"))=0,\"\",SRP!L23)","v":9},{"$f":"IF(SUMPRODUCT(N(SRP!$M23:'SRP'!$P23<>\"\"))=0,\"\",SRP!M23)","v":10},{"$f":"IF(SUMPRODUCT(N(SRP!$M23:'SRP'!$P23<>\"\"))=0,\"\",SRP!N23)","v":11},{"$f":"IF(SUMPRODUCT(N(SRP!$M23:'SRP'!$P23<>\"\"))=0,\"\",SRP!O23)","v":13},{"$f":"IF(SUMPRODUCT(N(SRP!$M23:'SRP'!$P23<>\"\"))=0,\"\",SRP!P23)","v":6},{"$f":"IF(SUMPRODUCT(N(SRP!$Q23:'SRP'!$X23<>\"\"))=0,\"\",SRP!Q23)","v":8},{"$f":"IF(SUMPRODUCT(N(SRP!$Q23:'SRP'!$X23<>\"\"))=0,\"\",SRP!R23)","v":9},{"$f":"IF(SUMPRODUCT(N(SRP!$Q23:'SRP'!$X23<>\"\"))=0,\"\",SRP!S23)","v":7},{"$f":"IF(SUMPRODUCT(N(SRP!$Q23:'SRP'!$X23<>\"\"))=0,\"\",SRP!T23)","v":5},{"$f":"IF(SUMPRODUCT(N(SRP!$Q23:'SRP'!$X23<>\"\"))=0,\"\",SRP!U23)","v":9},{"$f":"IF(SUMPRODUCT(N(SRP!$Q23:'SRP'!$X23<>\"\"))=0,\"\",SRP!V23)","v":9},{"$f":"IF(SUMPRODUCT(N(SRP!$Q23:'SRP'!$X23<>\"\"))=0,\"\",SRP!W23)","v":8},{"$f":"IF(SUMPRODUCT(N(SRP!$Q23:'SRP'!$X23<>\"\"))=0,\"\",SRP!X23)","v":7},{"$f":"IF(SUMPRODUCT(N(SRP!Y23<>\"\"))=0,\"\",ROUND(SRP!Y23, 2))","v":25},{"$f":"IF(SUMPRODUCT(N(SRP!Z23<>\"\"))=0,\"\",ROUND(SRP!Z23, 2))","v":24.17},{"$f":"IF(SUMPRODUCT(N(SRP!AA23<>\"\"))=0,\"\",ROUND(SRP!AA23, 2))","v":22.73},{"$f":"IF(SUMPRODUCT(N(SRP!AB23<>\"\"))=0,\"\",ROUND(SRP!AB23, 2))","v":19.38},{"$f":"IF(SUMPRODUCT(N(SRP!AL23<>\"\"))=0,\"\",SRP!AL23)","v":1}]
[null,null,null,null,null,{"$f":"IF(SRP!B24<>\"\",ROW(F7)-2,\"\")","v":5},{"$f":"IF(SUMPRODUCT(N(SRP!$C24<>\"\"))=0,\"\",SRP!C24)","v":"m"},{"$f":"IF(SUMPRODUCT(N(SRP!$D24<>\"\"))=0,\"\",SRP!D24)","v":"RG"},{"$f":"IF(SUMPRODUCT(N(SRP!$E24:'SRP'!$H24<>\"\"))=0,\"\",SRP!E24)","v":6},{"$f":"IF(SUMPRODUCT(N(SRP!$E24:'SRP'!$H24<>\"\"))=0,\"\",SRP!F24)","v":6},{"$f":"IF(SUMPRODUCT(N(SRP!$E24:'SRP'!$H24<>\"\"))=0,\"\",SRP!G24)","v":6},{"$f":"IF(SUMPRODUCT(N(SRP!$E24:'SRP'!$H24<>\"\"))=0,\"\",SRP!H24)","v":6},{"$f":"IF(SUMPRODUCT(N(SRP!$I24:'SRP'!$L24<>\"\"))=0,\"\",SRP!I24)","v":7},{"$f":"IF(SUMPRODUCT(N(SRP!$I24:'SRP'!$L24<>\"\"))=0,\"\",SRP!J24)","v":6},{"$f":"IF(SUMPRODUCT(N(SRP!$I24:'SRP'!$L24<>\"\"))=0,\"\",SRP!K24)","v":7},{"$f":"IF(SUMPRODUCT(N(SRP!$I24:'SRP'!$L24<>\"\"))=0,\"\",SRP!L24)","v":9},{"$f":"IF(SUMPRODUCT(N(SRP!$M24:'SRP'!$P24<>\"\"))=0,\"\",SRP!M24)","v":11},{"$f":"IF(SUMPRODUCT(N(SRP!$M24:'SRP'!$P24<>\"\"))=0,\"\",SRP!N24)","v":11},{"$f":"IF(SUMPRODUCT(N(SRP!$M24:'SRP'!$P24<>\"\"))=0,\"\",SRP!O24)","v":11},{"$f":"IF(SUMPRODUCT(N(SRP!$M24:'SRP'!$P24<>\"\"))=0,\"\",SRP!P24)","v":6},{"$f":"IF(SUMPRODUCT(N(SRP!$Q24:'SRP'!$X24<>\"\"))=0,\"\",SRP!Q24)","v":7},{"$f":"IF(SUMPRODUCT(N(SRP!$Q24:'SRP'!$X24<>\"\"))=0,\"\",SRP!R24)","v":8},{"$f":"IF(SUMPRODUCT(N(SRP!$Q24:'SRP'!$X24<>\"\"))=0,\"\",SRP!S24)","v":7},{"$f":"IF(SUMPRODUCT(N(SRP!$Q24:'SRP'!$X24<>\"\"))=0,\"\",SRP!T24)","v":7},{"$f":"IF(SUMPRODUCT(N(SRP!$Q24:'SRP'!$X24<>\"\"))=0,\"\",SRP!U24)","v":6},{"$f":"IF(SUMPRODUCT(N(SRP!$Q24:'SRP'!$X24<>\"\"))=0,\"\",SRP!V24)","v":6},{"$f":"IF(SUMPRODUCT(N(SRP!$Q24:'SRP'!$X24<>\"\"))=0,\"\",SRP!W24)","v":7},{"$f":"IF(SUMPRODUCT(N(SRP!$Q24:'SRP'!$X24<>\"\"))=0,\"\",SRP!X24)","v":7},{"$f":"IF(SUMPRODUCT(N(SRP!Y24<>\"\"))=0,\"\",ROUND(SRP!Y24, 2))","v":25},{"$f":"IF(SUMPRODUCT(N(SRP!Z24<>\"\"))=0,\"\",ROUND(SRP!Z24, 2))","v":24.17},{"$f":"IF(SUMPRODUCT(N(SRP!AA24<>\"\"))=0,\"\",ROUND(SRP!AA24, 2))","v":22.16},{"$f":"IF(SUMPRODUCT(N(SRP!AB24<>\"\"))=0,\"\",ROUND(SRP!AB24, 2))","v":17.190000000000001},{"$f":"IF(SUMPRODUCT(N(SRP!AL24<>\"\"))=0,\"\",SRP!AL24)","v":2}]
[null,null,null,null,null,{"$f":"IF(SRP!B25<>\"\",ROW(F8)-2,\"\")","v":6},{"$f":"IF(SUMPRODUCT(N(SRP!$C25<>\"\"))=0,\"\",SRP!C25)","v":"w"},{"$f":"IF(SUMPRODUCT(N(SRP!$D25<>\"\"))=0,\"\",SRP!D25)","v":"RG"},{"$f":"IF(SUMPRODUCT(N(SRP!$E25:'SRP'!$H25<>\"\"))=0,\"\",SRP!E25)","v":6},{"$f":"IF(SUMPRODUCT(N(SRP!$E25:'SRP'!$H25<>\"\"))=0,\"\",SRP!F25)","v":6},{"$f":"IF(SUMPRODUCT(N(SRP!$E25:'SRP'!$H25<>\"\"))=0,\"\",SRP!G25)","v":6},{"$f":"IF(SUMPRODUCT(N(SRP!$E25:'SRP'!$H25<>\"\"))=0,\"\",SRP!H25)","v":6},{"$f":"IF(SUMPRODUCT(N(SRP!$I25:'SRP'!$L25<>\"\"))=0,\"\",SRP!I25)","v":7},{"$f":"IF(SUMPRODUCT(N(SRP!$I25:'SRP'!$L25<>\"\"))=0,\"\",SRP!J25)","v":6},{"$f":"IF(SUMPRODUCT(N(SRP!$I25:'SRP'!$L25<>\"\"))=0,\"\",SRP!K25)","v":7},{"$f":"IF(SUMPRODUCT(N(SRP!$I25:'SRP'!$L25<>\"\"))=0,\"\",SRP!L25)","v":9},{"$f":"IF(SUMPRODUCT(N(SRP!$M25:'SRP'!$P25<>\"\"))=0,\"\",SRP!M25)","v":10},{"$f":"IF(SUMPRODUCT(N(SRP!$M25:'SRP'!$P25<>\"\"))=0,\"\",SRP!N25)","v":11},{"$f":"IF(SUMPRODUCT(N(SRP!$M25:'SRP'!$P25<>\"\"))=0,\"\",SRP!O25)","v":11},{"$f":"IF(SUMPRODUCT(N(SRP!$M25:'SRP'!$P25<>\"\"))=0,\"\",SRP!P25)","v":8},{"$f":"IF(SUMPRODUCT(N(SRP!$Q25:'SRP'!$X25<>\"\"))=0,\"\",SRP!Q25)","v":10},{"$f":"IF(SUMPRODUCT(N(SRP!$Q25:'SRP'!$X25<>\"\"))=0,\"\",SRP!R25)","v":10},{"$f":"IF(SUMPRODUCT(N(SRP!$Q25:'SRP'!$X25<>\"\"))=0,\"\",SRP!S25)","v":10},{"$f":"IF(SUMPRODUCT(N(SRP!$Q25:'SRP'!$X25<>\"\"))=0,\"\",SRP!T25)","v":10},{"$f":"IF(SUMPRODUCT(N(SRP!$Q25:'SRP'!$X25<>\"\"))=0,\"\",SRP!U25)","v":10},{"$f":"IF(SUMPRODUCT(N(SRP!$Q25:'SRP'!$X25<>\"\"))=0,\"\",SRP!V25)","v":10},{"$f":"IF(SUMPRODUCT(N(SRP!$Q25:'SRP'!$X25<>\"\"))=0,\"\",SRP!W25)","v":10},{"$f":"IF(SUMPRODUCT(N(SRP!$Q25:'SRP'!$X25<>\"\"))=0,\"\",SRP!X25)","v":10},{"$f":"IF(SUMPRODUCT(N(SRP!Y25<>\"\"))=0,\"\",ROUND(SRP!Y25, 2))","v":25},{"$f":"IF(SUMPRODUCT(N(SRP!Z25<>\"\"))=0,\"\",ROUND(SRP!Z25, 2))","v":24.17},{"$f":"IF(SUMPRODUCT(N(SRP!AA25<>\"\"))=0,\"\",ROUND(SRP!AA25, 2))","v":22.73},{"$f":"IF(SUMPRODUCT(N(SRP!AB25<>\"\"))=0,\"\",ROUND(SRP!AB25, 2))","v":25},{"$f":"IF(SUMPRODUCT(N(SRP!AL25<>\"\"))=0,\"\",SRP!AL25)","v":1}]
[null,null,null,null,null,{"$f":"IF(SRP!B26<>\"\",ROW(F9)-2,\"\")","v":7},{"$f":"IF(SUMPRODUCT(N(SRP!$C26<>\"\"))=0,\"\",SRP!C26)","v":"w"},{"$f":"IF(SUMPRODUCT(N(SRP!$D26<>\"\"))=0,\"\",SRP!D26)","v":"RG"},{"$f":"IF(SUMPRODUCT(N(SRP!$E26:'SRP'!$H26<>\"\"))=0,\"\",SRP!E26)","v":6},{"$f":"IF(SUMPRODUCT(N(SRP!$E26:'SRP'!$H26<>\"\"))=0,\"\",SRP!F26)","v":6},{"$f":"IF(SUMPRODUCT(N(SRP!$E26:'SRP'!$H26<>\"\"))=0,\"\",SRP!G26)","v":6},{"$f":"IF(SUMPRODUCT(N(SRP!$E26:'SRP'!$H26<>\"\"))=0,\"\",SRP!H26)","v":6},{"$f":"IF(SUMPRODUCT(N(SRP!$I26:'SRP'!$L26<>\"\"))=0,\"\",SRP!I26)","v":7},{"$f":"IF(SUMPRODUCT(N(SRP!$I26:'SRP'!$L26<>\"\"))=0,\"\",SRP!J26)","v":7},{"$f":"IF(SUMPRODUCT(N(SRP!$I26:'SRP'!$L26<>\"\"))=0,\"\",SRP!K26)","v":7},{"$f":"IF(SUMPRODUCT(N(SRP!$I26:'SRP'!$L26<>\"\"))=0,\"\",SRP!L26)","v":9},{"$f":"IF(SUMPRODUCT(N(SRP!$M26:'SRP'!$P26<>\"\"))=0,\"\",SRP!M26)","v":8},{"$f":"IF(SUMPRODUCT(N(SRP!$M26:'SRP'!$P26<>\"\"))=0,\"\",SRP!N26)","v":11},{"$f":"IF(SUMPRODUCT(N(SRP!$M26:'SRP'!$P26<>\"\"))=0,\"\",SRP!O26)","v":12},{"$f":"IF(SUMPRODUCT(N(SRP!$M26:'SRP'!$P26<>\"\"))=0,\"\",SRP!P26)","v":9},{"$f":"IF(SUMPRODUCT(N(SRP!$Q26:'SRP'!$X26<>\"\"))=0,\"\",SRP!Q26)","v":9},{"$f":"IF(SUMPRODUCT(N(SRP!$Q26:'SRP'!$X26<>\"\"))=0,\"\",SRP!R26)","v":10},{"$f":"IF(SUMPRODUCT(N(SRP!$Q26:'SRP'!$X26<>\"\"))=0,\"\",SRP!S26)","v":9},{"$f":"IF(SUMPRODUCT(N(SRP!$Q26:'SRP'!$X26<>\"\"))=0,\"\",SRP!T26)","v":8},{"$f":"IF(SUMPRODUCT(N(SRP!$Q26:'SRP'!$X26<>\"\"))=0,\"\",SRP!U26)","v":9},{"$f":"IF(SUMPRODUCT(N(SRP!$Q26:'SRP'!$X26<>\"\"))=0,\"\",SRP!V26)","v":9},{"$f":"IF(SUMPRODUCT(N(SRP!$Q26:'SRP'!$X26<>\"\"))=0,\"\",SRP!W26)","v":9},{"$f":"IF(SUMPRODUCT(N(SRP!$Q26:'SRP'!$X26<>\"\"))=0,\"\",SRP!X26)","v":8},{"$f":"IF(SUMPRODUCT(N(SRP!Y26<>\"\"))=0,\"\",ROUND(SRP!Y26, 2))","v":25},{"$f":"IF(SUMPRODUCT(N(SRP!Z26<>\"\"))=0,\"\",ROUND(SRP!Z26, 2))","v":25},{"$f":"IF(SUMPRODUCT(N(SRP!AA26<>\"\"))=0,\"\",ROUND(SRP!AA26, 2))","v":22.73},{"$f":"IF(SUMPRODUCT(N(SRP!AB26<>\"\"))=0,\"\",ROUND(SRP!AB26, 2))","v":22.19},{"$f":"IF(SUMPRODUCT(N(SRP!AL26<>\"\"))=0,\"\",SRP!AL26)","v":1}]
[null,null,null,null,null,{"$f":"IF(SRP!B27<>\"\",ROW(F10)-2,\"\")","v":8},{"$f":"IF(SUMPRODUCT(N(SRP!$C27<>\"\"))=0,\"\",SRP!C27)","v":"m"},{"$f":"IF(SUMPRODUCT(N(SRP!$D27<>\"\"))=0,\"\",SRP!D27)","v":"RG"},{"$f":"IF(SUMPRODUCT(N(SRP!$E27:'SRP'!$H27<>\"\"))=0,\"\",SRP!E27)","v":6},{"$f":"IF(SUMPRODUCT(N(SRP!$E27:'SRP'!$H27<>\"\"))=0,\"\",SRP!F27)","v":6},{"$f":"IF(SUMPRODUCT(N(SRP!$E27:'SRP'!$H27<>\"\"))=0,\"\",SRP!G27)","v":6},{"$f":"IF(SUMPRODUCT(N(SRP!$E27:'SRP'!$H27<>\"\"))=0,\"\",SRP!H27)","v":6},{"$f":"IF(SUMPRODUCT(N(SRP!$I27:'SRP'!$L27<>\"\"))=0,\"\",SRP!I27)","v":7},{"$f":"IF(SUMPRODUCT(N(SRP!$I27:'SRP'!$L27<>\"\"))=0,\"\",SRP!J27)","v":7},{"$f":"IF(SUMPRODUCT(N(SRP!$I27:'SRP'!$L27<>\"\"))=0,\"\",SRP!K27)","v":7},{"$f":"IF(SUMPRODUCT(N(SRP!$I27:'SRP'!$L27<>\"\"))=0,\"\",SRP!L27)","v":9},{"$f":"IF(SUMPRODUCT(N(SRP!$M27:'SRP'!$P27<>\"\"))=0,\"\",SRP!M27)","v":10},{"$f":"IF(SUMPRODUCT(N(SRP!$M27:'SRP'!$P27<>\"\"))=0,\"\",SRP!N27)","v":11},{"$f":"IF(SUMPRODUCT(N(SRP!$M27:'SRP'!$P27<>\"\"))=0,\"\",SRP!O27)","v":12},{"$f":"IF(SUMPRODUCT(N(SRP!$M27:'SRP'!$P27<>\"\"))=0,\"\",SRP!P27)","v":9},{"$f":"IF(SUMPRODUCT(N(SRP!$Q27:'SRP'!$X27<>\"\"))=0,\"\",SRP!Q27)","v":9},{"$f":"IF(SUMPRODUCT(N(SRP!$Q27:'SRP'!$X27<>\"\"))=0,\"\",SRP!R27)","v":10},{"$f":"IF(SUMPRODUCT(N(SRP!$Q27:'SRP'!$X27<>\"\"))=0,\"\",SRP!S27)","v":10},{"$f":"IF(SUMPRODUCT(N(SRP!$Q27:'SRP'!$X27<>\"\"))=0,\"\",SRP!T27)","v":10},{"$f":"IF(SUMPRODUCT(N(SRP!$Q27:'SRP'!$X27<>\"\"))=0,\"\",SRP!U27)","v":8},{"$f":"IF(SUMPRODUCT(N(SRP!$Q27:'SRP'!$X27<>\"\"))=0,\"\",SRP!V27)","v":10},{"$f":"IF(SUMPRODUCT(N(SRP!$Q27:'SRP'!$X27<>\"\"))=0,\"\",SRP!W27)","v":10},{"$f":"IF(SUMPRODUCT(N(SRP!$Q27:'SRP'!$X27<>\"\"))=0,\"\",SRP!X27)","v":10},{"$f":"IF(SUMPRODUCT(N(SRP!Y27<>\"\"))=0,\"\",ROUND(SRP!Y27, 2))","v":25},{"$f":"IF(SUMPRODUCT(N(SRP!Z27<>\"\"))=0,\"\",ROUND(SRP!Z27, 2))","v":25},{"$f":"IF(SUMPRODUCT(N(SRP!AA27<>\"\"))=0,\"\",ROUND(SRP!AA27, 2))","v":23.86},{"$f":"IF(SUMPRODUCT(N(SRP!AB27<>\"\"))=0,\"\",ROUND(SRP!AB27, 2))","v":24.06},{"$f":"IF(SUMPRODUCT(N(SRP!AL27<>\"\"))=0,\"\",SRP!AL27)","v":1}]
[null,null,null,null,null,{"$f":"IF(SRP!B28<>\"\",ROW(F11)-2,\"\")","v":9},{"$f":"IF(SUMPRODUCT(N(SRP!$C28<>\"\"))=0,\"\",SRP!C28)","v":"w"},{"$f":"IF(SUMPRODUCT(N(SRP!$D28<>\"\"))=0,\"\",SRP!D28)","v":"RG"},{"$f":"IF(SUMPRODUCT(N(SRP!$E28:'SRP'!$H28<>\"\"))=0,\"\",SRP!E28)","v":6},{"$f":"IF(SUMPRODUCT(N(SRP!$E28:'SRP'!$H28<>\"\"))=0,\"\",SRP!F28)","v":6},{"$f":"IF(SUMPRODUCT(N(SRP!$E28:'SRP'!$H28<>\"\"))=0,\"\",SRP!G28)","v":6},{"$f":"IF(SUMPRODUCT(N(SRP!$E28:'SRP'!$H28<>\"\"))=0,\"\",SRP!H28)","v":6},{"$f":"IF(SUMPRODUCT(N(SRP!$I28:'SRP'!$L28<>\"\"))=0,\"\",SRP!I28)","v":7},{"$f":"IF(SUMPRODUCT(N(SRP!$I28:'SRP'!$L28<>\"\"))=0,\"\",SRP!J28)","v":6},{"$f":"IF(SUMPRODUCT(N(SRP!$I28:'SRP'!$L28<>\"\"))=0,\"\",SRP!K28)","v":6},{"$f":"IF(SUMPRODUCT(N(SRP!$I28:'SRP'!$L28<>\"\"))=0,\"\",SRP!L28)","v":8},{"$f":"IF(SUMPRODUCT(N(SRP!$M28:'SRP'!$P28<>\"\"))=0,\"\",SRP!M28)","v":9},{"$f":"IF(SUMPRODUCT(N(SRP!$M28:'SRP'!$P28<>\"\"))=0,\"\",SRP!N28)","v":10},{"$f":"IF(SUMPRODUCT(N(SRP!$M28:'SRP'!$P28<>\"\"))=0,\"\",SRP!O28)","v":11},{"$f":"IF(SUMPRODUCT(N(SRP!$M28:'SRP'!$P28<>\"\"))=0,\"\",SRP!P28)","v":7},{"$f":"IF(SUMPRODUCT(N(SRP!$Q28:'SRP'!$X28<>\"\"))=0,\"\",SRP!Q28)","v":8},{"$f":"IF(SUMPRODUCT(N(SRP!$Q28:'SRP'!$X28<>\"\"))=0,\"\",SRP!R28)","v":8},{"$f":"IF(SUMPRODUCT(N(SRP!$Q28:'SRP'!$X28<>\"\"))=0,\"\",SRP!S28)","v":8},{"$f":"IF(SUMPRODUCT(N(SRP!$Q28:'SRP'!$X28<>\"\"))=0,\"\",SRP!T28)","v":7},{"$f":"IF(SUMPRODUCT(N(SRP!$Q28:'SRP'!$X28<>\"\"))=0,\"\",SRP!U28)","v":7},{"$f":"IF(SUMPRODUCT(N(SRP!$Q28:'SRP'!$X28<>\"\"))=0,\"\",SRP!V28)","v":6},{"$f":"IF(SUMPRODUCT(N(SRP!$Q28:'SRP'!$X28<>\"\"))=0,\"\",SRP!W28)","v":7},{"$f":"IF(SUMPRODUCT(N(SRP!$Q28:'SRP'!$X28<>\"\"))=0,\"\",SRP!X28)","v":6},{"$f":"IF(SUMPRODUCT(N(SRP!Y28<>\"\"))=0,\"\",ROUND(SRP!Y28, 2))","v":25},{"$f":"IF(SUMPRODUCT(N(SRP!Z28<>\"\"))=0,\"\",ROUND(SRP!Z28, 2))","v":22.5},{"$f":"IF(SUMPRODUCT(N(SRP!AA28<>\"\"))=0,\"\",ROUND(SRP!AA28, 2))","v":21.02},{"$f":"IF(SUMPRODUCT(N(SRP!AB28<>\"\"))=0,\"\",ROUND(SRP!AB28, 2))","v":17.809999999999999},{"$f":"IF(SUMPRODUCT(N(SRP!AL28<>\"\"))=0,\"\",SRP!AL28)","v":2}]
[null,null,null,null,null,{"$f":"IF(SRP!B29<>\"\",ROW(F12)-2,\"\")","v":10},{"$f":"IF(SUMPRODUCT(N(SRP!$C29<>\"\"))=0,\"\",SRP!C29)","v":"w"},{"$f":"IF(SUMPRODUCT(N(SRP!$D29<>\"\"))=0,\"\",SRP!D29)","v":"RG"},{"$f":"IF(SUMPRODUCT(N(SRP!$E29:'SRP'!$H29<>\"\"))=0,\"\",SRP!E29)","v":6},{"$f":"IF(SUMPRODUCT(N(SRP!$E29:'SRP'!$H29<>\"\"))=0,\"\",SRP!F29)","v":6},{"$f":"IF(SUMPRODUCT(N(SRP!$E29:'SRP'!$H29<>\"\"))=0,\"\",SRP!G29)","v":5},{"$f":"IF(SUMPRODUCT(N(SRP!$E29:'SRP'!$H29<>\"\"))=0,\"\",SRP!H29)","v":6},{"$f":"IF(SUMPRODUCT(N(SRP!$I29:'SRP'!$L29<>\"\"))=0,\"\",SRP!I29)","v":7},{"$f":"IF(SUMPRODUCT(N(SRP!$I29:'SRP'!$L29<>\"\"))=0,\"\",SRP!J29)","v":7},{"$f":"IF(SUMPRODUCT(N(SRP!$I29:'SRP'!$L29<>\"\"))=0,\"\",SRP!K29)","v":6},{"$f":"IF(SUMPRODUCT(N(SRP!$I29:'SRP'!$L29<>\"\"))=0,\"\",SRP!L29)","v":9},{"$f":"IF(SUMPRODUCT(N(SRP!$M29:'SRP'!$P29<>\"\"))=0,\"\",SRP!M29)","v":11},{"$f":"IF(SUMPRODUCT(N(SRP!$M29:'SRP'!$P29<>\"\"))=0,\"\",SRP!N29)","v":11},{"$f":"IF(SUMPRODUCT(N(SRP!$M29:'SRP'!$P29<>\"\"))=0,\"\",SRP!O29)","v":13},{"$f":"IF(SUMPRODUCT(N(SRP!$M29:'SRP'!$P29<>\"\"))=0,\"\",SRP!P29)","v":9},{"$f":"IF(SUMPRODUCT(N(SRP!$Q29:'SRP'!$X29<>\"\"))=0,\"\",SRP!Q29)","v":10},{"$f":"IF(SUMPRODUCT(N(SRP!$Q29:'SRP'!$X29<>\"\"))=0,\"\",SRP!R29)","v":10},{"$f":"IF(SUMPRODUCT(N(SRP!$Q29:'SRP'!$X29<>\"\"))=0,\"\",SRP!S29)","v":10},{"$f":"IF(SUMPRODUCT(N(SRP!$Q29:'SRP'!$X29<>\"\"))=0,\"\",SRP!T29)","v":10},{"$f":"IF(SUMPRODUCT(N(SRP!$Q29:'SRP'!$X29<>\"\"))=0,\"\",SRP!U29)","v":10},{"$f":"IF(SUMPRODUCT(N(SRP!$Q29:'SRP'!$X29<>\"\"))=0,\"\",SRP!V29)","v":10},{"$f":"IF(SUMPRODUCT(N(SRP!$Q29:'SRP'!$X29<>\"\"))=0,\"\",SRP!W29)","v":10},{"$f":"IF(SUMPRODUCT(N(SRP!$Q29:'SRP'!$X29<>\"\"))=0,\"\",SRP!X29)","v":10},{"$f":"IF(SUMPRODUCT(N(SRP!Y29<>\"\"))=0,\"\",ROUND(SRP!Y29, 2))","v":23.96},{"$f":"IF(SUMPRODUCT(N(SRP!Z29<>\"\"))=0,\"\",ROUND(SRP!Z29, 2))","v":24.17},{"$f":"IF(SUMPRODUCT(N(SRP!AA29<>\"\"))=0,\"\",ROUND(SRP!AA29, 2))","v":25},{"$f":"IF(SUMPRODUCT(N(SRP!AB29<>\"\"))=0,\"\",ROUND(SRP!AB29, 2))","v":25},{"$f":"IF(SUMPRODUCT(N(SRP!AL29<>\"\"))=0,\"\",SRP!AL29)","v":1}]
[null,null,null,null,null,{"$f":"IF(SRP!B30<>\"\",ROW(F13)-2,\"\")","v":11},{"$f":"IF(SUMPRODUCT(N(SRP!$C30<>\"\"))=0,\"\",SRP!C30)","v":"w"},{"$f":"IF(SUMPRODUCT(N(SRP!$D30<>\"\"))=0,\"\",SRP!D30)","v":"RG"},{"$f":"IF(SUMPRODUCT(N(SRP!$E30:'SRP'!$H30<>\"\"))=0,\"\",SRP!E30)","v":6},{"$f":"IF(SUMPRODUCT(N(SRP!$E30:'SRP'!$H30<>\"\"))=0,\"\",SRP!F30)","v":6},{"$f":"IF(SUMPRODUCT(N(SRP!$E30:'SRP'!$H30<>\"\"))=0,\"\",SRP!G30)","v":6},{"$f":"IF(SUMPRODUCT(N(SRP!$E30:'SRP'!$H30<>\"\"))=0,\"\",SRP!H30)","v":6},{"$f":"IF(SUMPRODUCT(N(SRP!$I30:'SRP'!$L30<>\"\"))=0,\"\",SRP!I30)","v":7},{"$f":"IF(SUMPRODUCT(N(SRP!$I30:'SRP'!$L30<>\"\"))=0,\"\",SRP!J30)","v":7},{"$f":"IF(SUMPRODUCT(N(SRP!$I30:'SRP'!$L30<>\"\"))=0,\"\",SRP!K30)","v":6},{"$f":"IF(SUMPRODUCT(N(SRP!$I30:'SRP'!$L30<>\"\"))=0,\"\",SRP!L30)","v":9},{"$f":"IF(SUMPRODUCT(N(SRP!$M30:'SRP'!$P30<>\"\"))=0,\"\",SRP!M30)","v":11},{"$f":"IF(SUMPRODUCT(N(SRP!$M30:'SRP'!$P30<>\"\"))=0,\"\",SRP!N30)","v":11},{"$f":"IF(SUMPRODUCT(N(SRP!$M30:'SRP'!$P30<>\"\"))=0,\"\",SRP!O30)","v":11},{"$f":"IF(SUMPRODUCT(N(SRP!$M30:'SRP'!$P30<>\"\"))=0,\"\",SRP!P30)","v":9},{"$f":"IF(SUMPRODUCT(N(SRP!$Q30:'SRP'!$X30<>\"\"))=0,\"\",SRP!Q30)","v":7},{"$f":"IF(SUMPRODUCT(N(SRP!$Q30:'SRP'!$X30<>\"\"))=0,\"\",SRP!R30)","v":8},{"$f":"IF(SUMPRODUCT(N(SRP!$Q30:'SRP'!$X30<>\"\"))=0,\"\",SRP!S30)","v":8},{"$f":"IF(SUMPRODUCT(N(SRP!$Q30:'SRP'!$X30<>\"\"))=0,\"\",SRP!T30)","v":8},{"$f":"IF(SUMPRODUCT(N(SRP!$Q30:'SRP'!$X30<>\"\"))=0,\"\",SRP!U30)","v":10},{"$f":"IF(SUMPRODUCT(N(SRP!$Q30:'SRP'!$X30<>\"\"))=0,\"\",SRP!V30)","v":10},{"$f":"IF(SUMPRODUCT(N(SRP!$Q30:'SRP'!$X30<>\"\"))=0,\"\",SRP!W30)","v":9},{"$f":"IF(SUMPRODUCT(N(SRP!$Q30:'SRP'!$X30<>\"\"))=0,\"\",SRP!X30)","v":8},{"$f":"IF(SUMPRODUCT(N(SRP!Y30<>\"\"))=0,\"\",ROUND(SRP!Y30, 2))","v":25},{"$f":"IF(SUMPRODUCT(N(SRP!Z30<>\"\"))=0,\"\",ROUND(SRP!Z30, 2))","v":24.17},{"$f":"IF(SUMPRODUCT(N(SRP!AA30<>\"\"))=0,\"\",ROUND(SRP!AA30, 2))","v":23.86},{"$f":"IF(SUMPRODUCT(N(SRP!AB30<>\"\"))=0,\"\",ROUND(SRP!AB30, 2))","v":21.25},{"$f":"IF(SUMPRODUCT(N(SRP!AL30<>\"\"))=0,\"\",SRP!AL30)","v":1}]
[null,null,null,null,null,{"$f":"IF(SRP!B31<>\"\",ROW(F14)-2,\"\")","v":12},{"$f":"IF(SUMPRODUCT(N(SRP!$C31<>\"\"))=0,\"\",SRP!C31)","v":"w"},{"$f":"IF(SUMPRODUCT(N(SRP!$D31<>\"\"))=0,\"\",SRP!D31)","v":"RG"},{"$f":"IF(SUMPRODUCT(N(SRP!$E31:'SRP'!$H31<>\"\"))=0,\"\",SRP!E31)","v":6},{"$f":"IF(SUMPRODUCT(N(SRP!$E31:'SRP'!$H31<>\"\"))=0,\"\",SRP!F31)","v":6},{"$f":"IF(SUMPRODUCT(N(SRP!$E31:'SRP'!$H31<>\"\"))=0,\"\",SRP!G31)","v":6},{"$f":"IF(SUMPRODUCT(N(SRP!$E31:'SRP'!$H31<>\"\"))=0,\"\",SRP!H31)","v":6},{"$f":"IF(SUMPRODUCT(N(SRP!$I31:'SRP'!$L31<>\"\"))=0,\"\",SRP!I31)","v":6},{"$f":"IF(SUMPRODUCT(N(SRP!$I31:'SRP'!$L31<>\"\"))=0,\"\",SRP!J31)","v":7},{"$f":"IF(SUMPRODUCT(N(SRP!$I31:'SRP'!$L31<>\"\"))=0,\"\",SRP!K31)","v":7},{"$f":"IF(SUMPRODUCT(N(SRP!$I31:'SRP'!$L31<>\"\"))=0,\"\",SRP!L31)","v":9},{"$f":"IF(SUMPRODUCT(N(SRP!$M31:'SRP'!$P31<>\"\"))=0,\"\",SRP!M31)","v":10},{"$f":"IF(SUMPRODUCT(N(SRP!$M31:'SRP'!$P31<>\"\"))=0,\"\",SRP!N31)","v":11},{"$f":"IF(SUMPRODUCT(N(SRP!$M31:'SRP'!$P31<>\"\"))=0,\"\",SRP!O31)","v":13},{"$f":"IF(SUMPRODUCT(N(SRP!$M31:'SRP'!$P31<>\"\"))=0,\"\",SRP!P31)","v":9},{"$f":"IF(SUMPRODUCT(N(SRP!$Q31:'SRP'!$X31<>\"\"))=0,\"\",SRP!Q31)","v":7},{"$f":"IF(SUMPRODUCT(N(SRP!$Q31:'SRP'!$X31<>\"\"))=0,\"\",SRP!R31)","v":5},{"$f":"IF(SUMPRODUCT(N(SRP!$Q31:'SRP'!$X31<>\"\"))=0,\"\",SRP!S31)","v":5},{"$f":"IF(SUMPRODUCT(N(SRP!$Q31:'SRP'!$X31<>\"\"))=0,\"\",SRP!T31)","v":4},{"$f":"IF(SUMPRODUCT(N(SRP!$Q31:'SRP'!$X31<>\"\"))=0,\"\",SRP!U31)","v":6},{"$f":"IF(SUMPRODUCT(N(SRP!$Q31:'SRP'!$X31<>\"\"))=0,\"\",SRP!V31)","v":6},{"$f":"IF(SUMPRODUCT(N(SRP!$Q31:'SRP'!$X31<>\"\"))=0,\"\",SRP!W31)","v":5},{"$f":"IF(SUMPRODUCT(N(SRP!$Q31:'SRP'!$X31<>\"\"))=0,\"\",SRP!X31)","v":4},{"$f":"IF(SUMPRODUCT(N(SRP!Y31<>\"\"))=0,\"\",ROUND(SRP!Y31, 2))","v":25},{"$f":"IF(SUMPRODUCT(N(SRP!Z31<>\"\"))=0,\"\",ROUND(SRP!Z31, 2))","v":24.17},{"$f":"IF(SUMPRODUCT(N(SRP!AA31<>\"\"))=0,\"\",ROUND(SRP!AA31, 2))","v":24.43},{"$f":"IF(SUMPRODUCT(N(SRP!AB31<>\"\"))=0,\"\",ROUND(SRP!AB31, 2))","v":13.13},{"$f":"IF(SUMPRODUCT(N(SRP!AL31<>\"\"))=0,\"\",SRP!AL31)","v":2}]
[null,null,null,null,null,{"$f":"IF(SRP!B32<>\"\",ROW(F15)-2,\"\")","v":13},{"$f":"IF(SUMPRODUCT(N(SRP!$C32<>\"\"))=0,\"\",SRP!C32)","v":"m"},{"$f":"IF(SUMPRODUCT(N(SRP!$D32<>\"\"))=0,\"\",SRP!D32)","v":"RG"},{"$f":"IF(SUMPRODUCT(N(SRP!$E32:'SRP'!$H32<>\"\"))=0,\"\",SRP!E32)","v":6},{"$f":"IF(SUMPRODUCT(N(SRP!$E32:'SRP'!$H32<>\"\"))=0,\"\",SRP!F32)","v":6},{"$f":"IF(SUMPRODUCT(N(SRP!$E32:'SRP'!$H32<>\"\"))=0,\"\",SRP!G32)","v":6},{"$f":"IF(SUMPRODUCT(N(SRP!$E32:'SRP'!$H32<>\"\"))=0,\"\",SRP!H32)","v":5},{"$f":"IF(SUMPRODUCT(N(SRP!$I32:'SRP'!$L32<>\"\"))=0,\"\",SRP!I32)","v":7},{"$f":"IF(SUMPRODUCT(N(SRP!$I32:'SRP'!$L32<>\"\"))=0,\"\",SRP!J32)","v":6},{"$f":"IF(SUMPRODUCT(N(SRP!$I32:'SRP'!$L32<>\"\"))=0,\"\",SRP!K32)","v":7},{"$f":"IF(SUMPRODUCT(N(SRP!$I32:'SRP'!$L32<>\"\"))=0,\"\",SRP!L32)","v":9},{"$f":"IF(SUMPRODUCT(N(SRP!$M32:'SRP'!$P32<>\"\"))=0,\"\",SRP!M32)","v":11},{"$f":"IF(SUMPRODUCT(N(SRP!$M32:'SRP'!$P32<>\"\"))=0,\"\",SRP!N32)","v":10},{"$f":"IF(SUMPRODUCT(N(SRP!$M32:'SRP'!$P32<>\"\"))=0,\"\",SRP!O32)","v":12},{"$f":"IF(SUMPRODUCT(N(SRP!$M32:'SRP'!$P32<>\"\"))=0,\"\",SRP!P32)","v":7},{"$f":"IF(SUMPRODUCT(N(SRP!$Q32:'SRP'!$X32<>\"\"))=0,\"\",SRP!Q32)","v":10},{"$f":"IF(SUMPRODUCT(N(SRP!$Q32:'SRP'!$X32<>\"\"))=0,\"\",SRP!R32)","v":10},{"$f":"IF(SUMPRODUCT(N(SRP!$Q32:'SRP'!$X32<>\"\"))=0,\"\",SRP!S32)","v":10},{"$f":"IF(SUMPRODUCT(N(SRP!$Q32:'SRP'!$X32<>\"\"))=0,\"\",SRP!T32)","v":10},{"$f":"IF(SUMPRODUCT(N(SRP!$Q32:'SRP'!$X32<>\"\"))=0,\"\",SRP!U32)","v":10},{"$f":"IF(SUMPRODUCT(N(SRP!$Q32:'SRP'!$X32<>\"\"))=0,\"\",SRP!V32)","v":10},{"$f":"IF(SUMPRODUCT(N(SRP!$Q32:'SRP'!$X32<>\"\"))=0,\"\",SRP!W32)","v":10},{"$f":"IF(SUMPRODUCT(N(SRP!$Q32:'SRP'!$X32<>\"\"))=0,\"\",SRP!X32)","v":7},{"$f":"IF(SUMPRODUCT(N(SRP!Y32<>\"\"))=0,\"\",ROUND(SRP!Y32, 2))","v":23.96},{"$f":"IF(SUMPRODUCT(N(SRP!Z32<>\"\"))=0,\"\",ROUND(SRP!Z32, 2))","v":24.17},{"$f":"IF(SUMPRODUCT(N(SRP!AA32<>\"\"))=0,\"\",ROUND(SRP!AA32, 2))","v":22.73},{"$f":"IF(SUMPRODUCT(N(SRP!AB32<>\"\"))=0,\"\",ROUND(SRP!AB32, 2))","v":24.06},{"$f":"IF(SUMPRODUCT(N(SRP!AL32<>\"\"))=0,\"\",SRP!AL32)","v":1}]
[null,null,null,null,null,{"$f":"IF(SRP!B33<>\"\",ROW(F16)-2,\"\")","v":14},{"$f":"IF(SUMPRODUCT(N(SRP!$C33<>\"\"))=0,\"\",SRP!C33)","v":"w"},{"$f":"IF(SUMPRODUCT(N(SRP!$D33<>\"\"))=0,\"\",SRP!D33)","v":"RG"},{"$f":"IF(SUMPRODUCT(N(SRP!$E33:'SRP'!$H33<>\"\"))=0,\"\",SRP!E33)","v":6},{"$f":"IF(SUMPRODUCT(N(SRP!$E33:'SRP'!$H33<>\"\"))=0,\"\",SRP!F33)","v":6},{"$f":"IF(SUMPRODUCT(N(SRP!$E33:'SRP'!$H33<>\"\"))=0,\"\",SRP!G33)","v":6},{"$f":"IF(SUMPRODUCT(N(SRP!$E33:'SRP'!$H33<>\"\"))=0,\"\",SRP!H33)","v":6},{"$f":"IF(SUMPRODUCT(N(SRP!$I33:'SRP'!$L33<>\"\"))=0,\"\",SRP!I33)","v":7},{"$f":"IF(SUMPRODUCT(N(SRP!$I33:'SRP'!$L33<>\"\"))=0,\"\",SRP!J33)","v":7},{"$f":"IF(SUMPRODUCT(N(SRP!$I33:'SRP'!$L33<>\"\"))=0,\"\",SRP!K33)","v":6},{"$f":"IF(SUMPRODUCT(N(SRP!$I33:'SRP'!$L33<>\"\"))=0,\"\",SRP!L33)","v":9},{"$f":"IF(SUMPRODUCT(N(SRP!$M33:'SRP'!$P33<>\"\"))=0,\"\",SRP!M33)","v":11},{"$f":"IF(SUMPRODUCT(N(SRP!$M33:'SRP'!$P33<>\"\"))=0,\"\",SRP!N33)","v":11},{"$f":"IF(SUMPRODUCT(N(SRP!$M33:'SRP'!$P33<>\"\"))=0,\"\",SRP!O33)","v":11},{"$f":"IF(SUMPRODUCT(N(SRP!$M33:'SRP'!$P33<>\"\"))=0,\"\",SRP!P33)","v":9},{"$f":"IF(SUMPRODUCT(N(SRP!$Q33:'SRP'!$X33<>\"\"))=0,\"\",SRP!Q33)","v":9},{"$f":"IF(SUMPRODUCT(N(SRP!$Q33:'SRP'!$X33<>\"\"))=0,\"\",SRP!R33)","v":10},{"$f":"IF(SUMPRODUCT(N(SRP!$Q33:'SRP'!$X33<>\"\"))=0,\"\",SRP!S33)","v":10},{"$f":"IF(SUMPRODUCT(N(SRP!$Q33:'SRP'!$X33<>\"\"))=0,\"\",SRP!T33)","v":9},{"$f":"IF(SUMPRODUCT(N(SRP!$Q33:'SRP'!$X33<>\"\"))=0,\"\",SRP!U33)","v":8},{"$f":"IF(SUMPRODUCT(N(SRP!$Q33:'SRP'!$X33<>\"\"))=0,\"\",SRP!V33)","v":10},{"$f":"IF(SUMPRODUCT(N(SRP!$Q33:'SRP'!$X33<>\"\"))=0,\"\",SRP!W33)","v":9},{"$f":"IF(SUMPRODUCT(N(SRP!$Q33:'SRP'!$X33<>\"\"))=0,\"\",SRP!X33)","v":8},{"$f":"IF(SUMPRODUCT(N(SRP!Y33<>\"\"))=0,\"\",ROUND(SRP!Y33, 2))","v":25},{"$f":"IF(SUMPRODUCT(N(SRP!Z33<>\"\"))=0,\"\",ROUND(SRP!Z33, 2))","v":24.17},{"$f":"IF(SUMPRODUCT(N(SRP!AA33<>\"\"))=0,\"\",ROUND(SRP!AA33, 2))","v":23.86},{"$f":"IF(SUMPRODUCT(N(SRP!AB33<>\"\"))=0,\"\",ROUND(SRP!AB33, 2))","v":22.81},{"$f":"IF(SUMPRODUCT(N(SRP!AL33<>\"\"))=0,\"\",SRP!AL33)","v":1}]
[null,null,null,null,null,{"$f":"IF(SRP!B34<>\"\",ROW(F17)-2,\"\")","v":15},{"$f":"IF(SUMPRODUCT(N(SRP!$C34<>\"\"))=0,\"\",SRP!C34)","v":"m"},{"$f":"IF(SUMPRODUCT(N(SRP!$D34<>\"\"))=0,\"\",SRP!D34)","v":"RG"},{"$f":"IF(SUMPRODUCT(N(SRP!$E34:'SRP'!$H34<>\"\"))=0,\"\",SRP!E34)","v":6},{"$f":"IF(SUMPRODUCT(N(SRP!$E34:'SRP'!$H34<>\"\"))=0,\"\",SRP!F34)","v":5},{"$f":"IF(SUMPRODUCT(N(SRP!$E34:'SRP'!$H34<>\"\"))=0,\"\",SRP!G34)","v":6},{"$f":"IF(SUMPRODUCT(N(SRP!$E34:'SRP'!$H34<>\"\"))=0,\"\",SRP!H34)","v":5},{"$f":"IF(SUMPRODUCT(N(SRP!$I34:'SRP'!$L34<>\"\"))=0,\"\",SRP!I34)","v":7},{"$f":"IF(SUMPRODUCT(N(SRP!$I34:'SRP'!$L34<>\"\"))=0,\"\",SRP!J34)","v":7},{"$f":"IF(SUMPRODUCT(N(SRP!$I34:'SRP'!$L34<>\"\"))=0,\"\",SRP!K34)","v":5},{"$f":"IF(SUMPRODUCT(N(SRP!$I34:'SRP'!$L34<>\"\"))=0,\"\",SRP!L34)","v":9},{"$f":"IF(SUMPRODUCT(N(SRP!$M34:'SRP'!$P34<>\"\"))=0,\"\",SRP!M34)","v":9},{"$f":"IF(SUMPRODUCT(N(SRP!$M34:'SRP'!$P34<>\"\"))=0,\"\",SRP!N34)","v":9},{"$f":"IF(SUMPRODUCT(N(SRP!$M34:'SRP'!$P34<>\"\"))=0,\"\",SRP!O34)","v":8},{"$f":"IF(SUMPRODUCT(N(SRP!$M34:'SRP'!$P34<>\"\"))=0,\"\",SRP!P34)","v":5},{"$f":"IF(SUMPRODUCT(N(SRP!$Q34:'SRP'!$X34<>\"\"))=0,\"\",SRP!Q34)","v":5},{"$f":"IF(SUMPRODUCT(N(SRP!$Q34:'SRP'!$X34<>\"\"))=0,\"\",SRP!R34)","v":6},{"$f":"IF(SUMPRODUCT(N(SRP!$Q34:'SRP'!$X34<>\"\"))=0,\"\",SRP!S34)","v":6},{"$f":"IF(SUMPRODUCT(N(SRP!$Q34:'SRP'!$X34<>\"\"))=0,\"\",SRP!T34)","v":6},{"$f":"IF(SUMPRODUCT(N(SRP!$Q34:'SRP'!$X34<>\"\"))=0,\"\",SRP!U34)","v":5},{"$f":"IF(SUMPRODUCT(N(SRP!$Q34:'SRP'!$X34<>\"\"))=0,\"\",SRP!V34)","v":5},{"$f":"IF(SUMPRODUCT(N(SRP!$Q34:'SRP'!$X34<>\"\"))=0,\"\",SRP!W34)","v":6},{"$f":"IF(SUMPRODUCT(N(SRP!$Q34:'SRP'!$X34<>\"\"))=0,\"\",SRP!X34)","v":6},{"$f":"IF(SUMPRODUCT(N(SRP!Y34<>\"\"))=0,\"\",ROUND(SRP!Y34, 2))","v":22.92},{"$f":"IF(SUMPRODUCT(N(SRP!Z34<>\"\"))=0,\"\",ROUND(SRP!Z34, 2))","v":23.33},{"$f":"IF(SUMPRODUCT(N(SRP!AA34<>\"\"))=0,\"\",ROUND(SRP!AA34, 2))","v":17.61},{"$f":"IF(SUMPRODUCT(N(SRP!AB34<>\"\"))=0,\"\",ROUND(SRP!AB34, 2))","v":14.06},{"$f":"IF(SUMPRODUCT(N(SRP!AL34<>\"\"))=0,\"\",SRP!AL34)","v":3}]
[null,null,null,null,null,{"$f":"IF(SRP!B35<>\"\",ROW(F18)-2,\"\")","v":16},{"$f":"IF(SUMPRODUCT(N(SRP!$C35<>\"\"))=0,\"\",SRP!C35)","v":"w"},{"$f":"IF(SUMPRODUCT(N(SRP!$D35<>\"\"))=0,\"\",SRP!D35)","v":"RG"},{"$f":"IF(SUMPRODUCT(N(SRP!$E35:'SRP'!$H35<>\"\"))=0,\"\",SRP!E35)","v":6},{"$f":"IF(SUMPRODUCT(N(SRP!$E35:'SRP'!$H35<>\"\"))=0,\"\",SRP!F35)","v":6},{"$f":"IF(SUMPRODUCT(N(SRP!$E35:'SRP'!$H35<>\"\"))=0,\"\",SRP!G35)","v":6},{"$f":"IF(SUMPRODUCT(N(SRP!$E35:'SRP'!$H35<>\"\"))=0,\"\",SRP!H35)","v":6},{"$f":"IF(SUMPRODUCT(N(SRP!$I35:'SRP'!$L35<>\"\"))=0,\"\",SRP!I35)","v":7},{"$f":"IF(SUMPRODUCT(N(SRP!$I35:'SRP'!$L35<>\"\"))=0,\"\",SRP!J35)","v":7},{"$f":"IF(SUMPRODUCT(N(SRP!$I35:'SRP'!$L35<>\"\"))=0,\"\",SRP!K35)","v":7},{"$f":"IF(SUMPRODUCT(N(SRP!$I35:'SRP'!$L35<>\"\"))=0,\"\",SRP!L35)","v":9},{"$f":"IF(SUMPRODUCT(N(SRP!$M35:'SRP'!$P35<>\"\"))=0,\"\",SRP!M35)","v":9},{"$f":"IF(SUMPRODUCT(N(SRP!$M35:'SRP'!$P35<>\"\"))=0,\"\",SRP!N35)","v":11},{"$f":"IF(SUMPRODUCT(N(SRP!$M35:'SRP'!$P35<>\"\"))=0,\"\",SRP!O35)","v":12},{"$f":"IF(SUMPRODUCT(N(SRP!$M35:'SRP'!$P35<>\"\"))=0,\"\",SRP!P35)","v":9},{"$f":"IF(SUMPRODUCT(N(SRP!$Q35:'SRP'!$X35<>\"\"))=0,\"\",SRP!Q35)","v":9},{"$f":"IF(SUMPRODUCT(N(SRP!$Q35:'SRP'!$X35<>\"\"))=0,\"\",SRP!R35)","v":9},{"$f":"IF(SUMPRODUCT(N(SRP!$Q35:'SRP'!$X35<>\"\"))=0,\"\",SRP!S35)","v":7},{"$f":"IF(SUMPRODUCT(N(SRP!$Q35:'SRP'!$X35<>\"\"))=0,\"\",SRP!T35)","v":6},{"$f":"IF(SUMPRODUCT(N(SRP!$Q35:'SRP'!$X35<>\"\"))=0,\"\",SRP!U35)","v":6},{"$f":"IF(SUMPRODUCT(N(SRP!$Q35:'SRP'!$X35<>\"\"))=0,\"\",SRP!V35)","v":5},{"$f":"IF(SUMPRODUCT(N(SRP!$Q35:'SRP'!$X35<>\"\"))=0,\"\",SRP!W35)","v":5},{"$f":"IF(SUMPRODUCT(N(SRP!$Q35:'SRP'!$X35<>\"\"))=0,\"\",SRP!X35)","v":5},{"$f":"IF(SUMPRODUCT(N(SRP!Y35<>\"\"))=0,\"\",ROUND(SRP!Y35, 2))","v":25},{"$f":"IF(SUMPRODUCT(N(SRP!Z35<>\"\"))=0,\"\",ROUND(SRP!Z35, 2))","v":25},{"$f":"IF(SUMPRODUCT(N(SRP!AA35<>\"\"))=0,\"\",ROUND(SRP!AA35, 2))","v":23.3},{"$f":"IF(SUMPRODUCT(N(SRP!AB35<>\"\"))=0,\"\",ROUND(SRP!AB35, 2))","v":16.25},{"$f":"IF(SUMPRODUCT(N(SRP!AL35<>\"\"))=0,\"\",SRP!AL35)","v":2}]
[null,null,null,null,null,{"$f":"IF(SRP!B36<>\"\",ROW(F19)-2,\"\")","v":17},{"$f":"IF(SUMPRODUCT(N(SRP!$C36<>\"\"))=0,\"\",SRP!C36)","v":"w"},{"$f":"IF(SUMPRODUCT(N(SRP!$D36<>\"\"))=0,\"\",SRP!D36)","v":"RG"},{"$f":"IF(SUMPRODUCT(N(SRP!$E36:'SRP'!$H36<>\"\"))=0,\"\",SRP!E36)","v":6},{"$f":"IF(SUMPRODUCT(N(SRP!$E36:'SRP'!$H36<>\"\"))=0,\"\",SRP!F36)","v":6},{"$f":"IF(SUMPRODUCT(N(SRP!$E36:'SRP'!$H36<>\"\"))=0,\"\",SRP!G36)","v":6},{"$f":"IF(SUMPRODUCT(N(SRP!$E36:'SRP'!$H36<>\"\"))=0,\"\",SRP!H36)","v":5},{"$f":"IF(SUMPRODUCT(N(SRP!$I36:'SRP'!$L36<>\"\"))=0,\"\",SRP!I36)","v":7},{"$f":"IF(SUMPRODUCT(N(SRP!$I36:'SRP'!$L36<>\"\"))=0,\"\",SRP!J36)","v":6},{"$f":"IF(SUMPRODUCT(N(SRP!$I36:'SRP'!$L36<>\"\"))=0,\"\",SRP!K36)","v":7},{"$f":"IF(SUMPRODUCT(N(SRP!$I36:'SRP'!$L36<>\"\"))=0,\"\",SRP!L36)","v":8},{"$f":"IF(SUMPRODUCT(N(SRP!$M36:'SRP'!$P36<>\"\"))=0,\"\",SRP!M36)","v":8},{"$f":"IF(SUMPRODUCT(N(SRP!$M36:'SRP'!$P36<>\"\"))=0,\"\",SRP!N36)","v":11},{"$f":"IF(SUMPRODUCT(N(SRP!$M36:'SRP'!$P36<>\"\"))=0,\"\",SRP!O36)","v":11},{"$f":"IF(SUMPRODUCT(N(SRP!$M36:'SRP'!$P36<>\"\"))=0,\"\",SRP!P36)","v":7},{"$f":"IF(SUMPRODUCT(N(SRP!$Q36:'SRP'!$X36<>\"\"))=0,\"\",SRP!Q36)","v":5},{"$f":"IF(SUMPRODUCT(N(SRP!$Q36:'SRP'!$X36<>\"\"))=0,\"\",SRP!R36)","v":5},{"$f":"IF(SUMPRODUCT(N(SRP!$Q36:'SRP'!$X36<>\"\"))=0,\"\",SRP!S36)","v":6},{"$f":"IF(SUMPRODUCT(N(SRP!$Q36:'SRP'!$X36<>\"\"))=0,\"\",SRP!T36)","v":6},{"$f":"IF(SUMPRODUCT(N(SRP!$Q36:'SRP'!$X36<>\"\"))=0,\"\",SRP!U36)","v":5},{"$f":"IF(SUMPRODUCT(N(SRP!$Q36:'SRP'!$X36<>\"\"))=0,\"\",SRP!V36)","v":6},{"$f":"IF(SUMPRODUCT(N(SRP!$Q36:'SRP'!$X36<>\"\"))=0,\"\",SRP!W36)","v":6},{"$f":"IF(SUMPRODUCT(N(SRP!$Q36:'SRP'!$X36<>\"\"))=0,\"\",SRP!X36)","v":6},{"$f":"IF(SUMPRODUCT(N(SRP!Y36<>\"\"))=0,\"\",ROUND(SRP!Y36, 2))","v":23.96},{"$f":"IF(SUMPRODUCT(N(SRP!Z36<>\"\"))=0,\"\",ROUND(SRP!Z36, 2))","v":23.33},{"$f":"IF(SUMPRODUCT(N(SRP!AA36<>\"\"))=0,\"\",ROUND(SRP!AA36, 2))","v":21.02},{"$f":"IF(SUMPRODUCT(N(SRP!AB36<>\"\"))=0,\"\",ROUND(SRP!AB36, 2))","v":14.06},{"$f":"IF(SUMPRODUCT(N(SRP!AL36<>\"\"))=0,\"\",SRP!AL36)","v":2}]
[null,null,null,null,null,{"$f":"IF(SRP!B37<>\"\",ROW(F20)-2,\"\")","v":18},{"$f":"IF(SUMPRODUCT(N(SRP!$C37<>\"\"))=0,\"\",SRP!C37)","v":"m"},{"$f":"IF(SUMPRODUCT(N(SRP!$D37<>\"\"))=0,\"\",SRP!D37)","v":"RG"},{"$f":"IF(SUMPRODUCT(N(SRP!$E37:'SRP'!$H37<>\"\"))=0,\"\",SRP!E37)","v":6},{"$f":"IF(SUMPRODUCT(N(SRP!$E37:'SRP'!$H37<>\"\"))=0,\"\",SRP!F37)","v":6},{"$f":"IF(SUMPRODUCT(N(SRP!$E37:'SRP'!$H37<>\"\"))=0,\"\",SRP!G37)","v":6},{"$f":"IF(SUMPRODUCT(N(SRP!$E37:'SRP'!$H37<>\"\"))=0,\"\",SRP!H37)","v":6},{"$f":"IF(SUMPRODUCT(N(SRP!$I37:'SRP'!$L37<>\"\"))=0,\"\",SRP!I37)","v":7},{"$f":"IF(SUMPRODUCT(N(SRP!$I37:'SRP'!$L37<>\"\"))=0,\"\",SRP!J37)","v":6},{"$f":"IF(SUMPRODUCT(N(SRP!$I37:'SRP'!$L37<>\"\"))=0,\"\",SRP!K37)","v":7},{"$f":"IF(SUMPRODUCT(N(SRP!$I37:'SRP'!$L37<>\"\"))=0,\"\",SRP!L37)","v":9},{"$f":"IF(SUMPRODUCT(N(SRP!$M37:'SRP'!$P37<>\"\"))=0,\"\",SRP!M37)","v":11},{"$f":"IF(SUMPRODUCT(N(SRP!$M37:'SRP'!$P37<>\"\"))=0,\"\",SRP!N37)","v":11},{"$f":"IF(SUMPRODUCT(N(SRP!$M37:'SRP'!$P37<>\"\"))=0,\"\",SRP!O37)","v":13},{"$f":"IF(SUMPRODUCT(N(SRP!$M37:'SRP'!$P37<>\"\"))=0,\"\",SRP!P37)","v":9},{"$f":"IF(SUMPRODUCT(N(SRP!$Q37:'SRP'!$X37<>\"\"))=0,\"\",SRP!Q37)","v":9},{"$f":"IF(SUMPRODUCT(N(SRP!$Q37:'SRP'!$X37<>\"\"))=0,\"\",SRP!R37)","v":9},{"$f":"IF(SUMPRODUCT(N(SRP!$Q37:'SRP'!$X37<>\"\"))=0,\"\",SRP!S37)","v":8},{"$f":"IF(SUMPRODUCT(N(SRP!$Q37:'SRP'!$X37<>\"\"))=0,\"\",SRP!T37)","v":8},{"$f":"IF(SUMPRODUCT(N(SRP!$Q37:'SRP'!$X37<>\"\"))=0,\"\",SRP!U37)","v":8},{"$f":"IF(SUMPRODUCT(N(SRP!$Q37:'SRP'!$X37<>\"\"))=0,\"\",SRP!V37)","v":8},{"$f":"IF(SUMPRODUCT(N(SRP!$Q37:'SRP'!$X37<>\"\"))=0,\"\",SRP!W37)","v":8},{"$f":"IF(SUMPRODUCT(N(SRP!$Q37:'SRP'!$X37<>\"\"))=0,\"\",SRP!X37)","v":8},{"$f":"IF(SUMPRODUCT(N(SRP!Y37<>\"\"))=0,\"\",ROUND(SRP!Y37, 2))","v":25},{"$f":"IF(SUMPRODUCT(N(SRP!Z37<>\"\"))=0,\"\",ROUND(SRP!Z37, 2))","v":24.17},{"$f":"IF(SUMPRODUCT(N(SRP!AA37<>\"\"))=0,\"\",ROUND(SRP!AA37, 2))","v":25},{"$f":"IF(SUMPRODUCT(N(SRP!AB37<>\"\"))=0,\"\",ROUND(SRP!AB37, 2))","v":20.63},{"$f":"IF(SUMPRODUCT(N(SRP!AL37<>\"\"))=0,\"\",SRP!AL37)","v":1}]
[null,null,null,null,null,{"$f":"IF(SRP!B38<>\"\",ROW(F21)-2,\"\")","v":19},{"$f":"IF(SUMPRODUCT(N(SRP!$C38<>\"\"))=0,\"\",SRP!C38)","v":"w"},{"$f":"IF(SUMPRODUCT(N(SRP!$D38<>\"\"))=0,\"\",SRP!D38)","v":"RG"},{"$f":"IF(SUMPRODUCT(N(SRP!$E38:'SRP'!$H38<>\"\"))=0,\"\",SRP!E38)","v":6},{"$f":"IF(SUMPRODUCT(N(SRP!$E38:'SRP'!$H38<>\"\"))=0,\"\",SRP!F38)","v":6},{"$f":"IF(SUMPRODUCT(N(SRP!$E38:'SRP'!$H38<>\"\"))=0,\"\",SRP!G38)","v":6},{"$f":"IF(SUMPRODUCT(N(SRP!$E38:'SRP'!$H38<>\"\"))=0,\"\",SRP!H38)","v":6},{"$f":"IF(SUMPRODUCT(N(SRP!$I38:'SRP'!$L38<>\"\"))=0,\"\",SRP!I38)","v":7},{"$f":"IF(SUMPRODUCT(N(SRP!$I38:'SRP'!$L38<>\"\"))=0,\"\",SRP!J38)","v":7},{"$f":"IF(SUMPRODUCT(N(SRP!$I38:'SRP'!$L38<>\"\"))=0,\"\",SRP!K38)","v":6},{"$f":"IF(SUMPRODUCT(N(SRP!$I38:'SRP'!$L38<>\"\"))=0,\"\",SRP!L38)","v":9},{"$f":"IF(SUMPRODUCT(N(SRP!$M38:'SRP'!$P38<>\"\"))=0,\"\",SRP!M38)","v":5},{"$f":"IF(SUMPRODUCT(N(SRP!$M38:'SRP'!$P38<>\"\"))=0,\"\",SRP!N38)","v":7},{"$f":"IF(SUMPRODUCT(N(SRP!$M38:'SRP'!$P38<>\"\"))=0,\"\",SRP!O38)","v":9},{"$f":"IF(SUMPRODUCT(N(SRP!$M38:'SRP'!$P38<>\"\"))=0,\"\",SRP!P38)","v":3},{"$f":"IF(SUMPRODUCT(N(SRP!$Q38:'SRP'!$X38<>\"\"))=0,\"\",SRP!Q38)","v":8},{"$f":"IF(SUMPRODUCT(N(SRP!$Q38:'SRP'!$X38<>\"\"))=0,\"\",SRP!R38)","v":7},{"$f":"IF(SUMPRODUCT(N(SRP!$Q38:'SRP'!$X38<>\"\"))=0,\"\",SRP!S38)","v":7},{"$f":"IF(SUMPRODUCT(N(SRP!$Q38:'SRP'!$X38<>\"\"))=0,\"\",SRP!T38)","v":7},{"$f":"IF(SUMPRODUCT(N(SRP!$Q38:'SRP'!$X38<>\"\"))=0,\"\",SRP!U38)","v":6},{"$f":"IF(SUMPRODUCT(N(SRP!$Q38:'SRP'!$X38<>\"\"))=0,\"\",SRP!V38)","v":6},{"$f":"IF(SUMPRODUCT(N(SRP!$Q38:'SRP'!$X38<>\"\"))=0,\"\",SRP!W38)","v":6},{"$f":"IF(SUMPRODUCT(N(SRP!$Q38:'SRP'!$X38<>\"\"))=0,\"\",SRP!X38)","v":6},{"$f":"IF(SUMPRODUCT(N(SRP!Y38<>\"\"))=0,\"\",ROUND(SRP!Y38, 2))","v":25},{"$f":"IF(SUMPRODUCT(N(SRP!Z38<>\"\"))=0,\"\",ROUND(SRP!Z38, 2))","v":24.17},{"$f":"IF(SUMPRODUCT(N(SRP!AA38<>\"\"))=0,\"\",ROUND(SRP!AA38, 2))","v":13.64},{"$f":"IF(SUMPRODUCT(N(SRP!AB38<>\"\"))=0,\"\",ROUND(SRP!AB38, 2))","v":16.559999999999999},{"$f":"IF(SUMPRODUCT(N(SRP!AL38<>\"\"))=0,\"\",SRP!AL38)","v":3}]
[null,null,null,null,null,{"$f":"IF(SRP!B39<>\"\",ROW(F22)-2,\"\")","v":20},{"$f":"IF(SUMPRODUCT(N(SRP!$C39<>\"\"))=0,\"\",SRP!C39)","v":"w"},{"$f":"IF(SUMPRODUCT(N(SRP!$D39<>\"\"))=0,\"\",SRP!D39)","v":"RG"},{"$f":"IF(SUMPRODUCT(N(SRP!$E39:'SRP'!$H39<>\"\"))=0,\"\",SRP!E39)","v":4},{"$f":"IF(SUMPRODUCT(N(SRP!$E39:'SRP'!$H39<>\"\"))=0,\"\",SRP!F39)","v":6},{"$f":"IF(SUMPRODUCT(N(SRP!$E39:'SRP'!$H39<>\"\"))=0,\"\",SRP!G39)","v":6},{"$f":"IF(SUMPRODUCT(N(SRP!$E39:'SRP'!$H39<>\"\"))=0,\"\",SRP!H39)","v":6},{"$f":"IF(SUMPRODUCT(N(SRP!$I39:'SRP'!$L39<>\"\"))=0,\"\",SRP!I39)","v":7},{"$f":"IF(SUMPRODUCT(N(SRP!$I39:'SRP'!$L39<>\"\"))=0,\"\",SRP!J39)","v":7},{"$f":"IF(SUMPRODUCT(N(SRP!$I39:'SRP'!$L39<>\"\"))=0,\"\",SRP!K39)","v":7},{"$f":"IF(SUMPRODUCT(N(SRP!$I39:'SRP'!$L39<>\"\"))=0,\"\",SRP!L39)","v":9},{"$f":"IF(SUMPRODUCT(N(SRP!$M39:'SRP'!$P39<>\"\"))=0,\"\",SRP!M39)","v":11},{"$f":"IF(SUMPRODUCT(N(SRP!$M39:'SRP'!$P39<>\"\"))=0,\"\",SRP!N39)","v":11},{"$f":"IF(SUMPRODUCT(N(SRP!$M39:'SRP'!$P39<>\"\"))=0,\"\",SRP!O39)","v":13},{"$f":"IF(SUMPRODUCT(N(SRP!$M39:'SRP'!$P39<>\"\"))=0,\"\",SRP!P39)","v":9},{"$f":"IF(SUMPRODUCT(N(SRP!$Q39:'SRP'!$X39<>\"\"))=0,\"\",SRP!Q39)","v":10},{"$f":"IF(SUMPRODUCT(N(SRP!$Q39:'SRP'!$X39<>\"\"))=0,\"\",SRP!R39)","v":10},{"$f":"IF(SUMPRODUCT(N(SRP!$Q39:'SRP'!$X39<>\"\"))=0,\"\",SRP!S39)","v":9},{"$f":"IF(SUMPRODUCT(N(SRP!$Q39:'SRP'!$X39<>\"\"))=0,\"\",SRP!T39)","v":8},{"$f":"IF(SUMPRODUCT(N(SRP!$Q39:'SRP'!$X39<>\"\"))=0,\"\",SRP!U39)","v":8},{"$f":"IF(SUMPRODUCT(N(SRP!$Q39:'SRP'!$X39<>\"\"))=0,\"\",SRP!V39)","v":10},{"$f":"IF(SUMPRODUCT(N(SRP!$Q39:'SRP'!$X39<>\"\"))=0,\"\",SRP!W39)","v":10},{"$f":"IF(SUMPRODUCT(N(SRP!$Q39:'SRP'!$X39<>\"\"))=0,\"\",SRP!X39)","v":10},{"$f":"IF(SUMPRODUCT(N(SRP!Y39<>\"\"))=0,\"\",ROUND(SRP!Y39, 2))","v":22.92},{"$f":"IF(SUMPRODUCT(N(SRP!Z39<>\"\"))=0,\"\",ROUND(SRP!Z39, 2))","v":25},{"$f":"IF(SUMPRODUCT(N(SRP!AA39<>\"\"))=0,\"\",ROUND(SRP!AA39, 2))","v":25},{"$f":"IF(SUMPRODUCT(N(SRP!AB39<>\"\"))=0,\"\",ROUND(SRP!AB39, 2))","v":23.44},{"$f":"IF(SUMPRODUCT(N(SRP!AL39<>\"\"))=0,\"\",SRP!AL39)","v":1}]
[null,null,null,null,null,{"$f":"IF(SRP!B40<>\"\",ROW(F23)-2,\"\")","v":21},{"$f":"IF(SUMPRODUCT(N(SRP!$C40<>\"\"))=0,\"\",SRP!C40)","v":"w"},{"$f":"IF(SUMPRODUCT(N(SRP!$D40<>\"\"))=0,\"\",SRP!D40)","v":"RG"},{"$f":"IF(SUMPRODUCT(N(SRP!$E40:'SRP'!$H40<>\"\"))=0,\"\",SRP!E40)","v":6},{"$f":"IF(SUMPRODUCT(N(SRP!$E40:'SRP'!$H40<>\"\"))=0,\"\",SRP!F40)","v":6},{"$f":"IF(SUMPRODUCT(N(SRP!$E40:'SRP'!$H40<>\"\"))=0,\"\",SRP!G40)","v":6},{"$f":"IF(SUMPRODUCT(N(SRP!$E40:'SRP'!$H40<>\"\"))=0,\"\",SRP!H40)","v":6},{"$f":"IF(SUMPRODUCT(N(SRP!$I40:'SRP'!$L40<>\"\"))=0,\"\",SRP!I40)","v":7},{"$f":"IF(SUMPRODUCT(N(SRP!$I40:'SRP'!$L40<>\"\"))=0,\"\",SRP!J40)","v":7},{"$f":"IF(SUMPRODUCT(N(SRP!$I40:'SRP'!$L40<>\"\"))=0,\"\",SRP!K40)","v":6},{"$f":"IF(SUMPRODUCT(N(SRP!$I40:'SRP'!$L40<>\"\"))=0,\"\",SRP!L40)","v":9},{"$f":"IF(SUMPRODUCT(N(SRP!$M40:'SRP'!$P40<>\"\"))=0,\"\",SRP!M40)","v":11},{"$f":"IF(SUMPRODUCT(N(SRP!$M40:'SRP'!$P40<>\"\"))=0,\"\",SRP!N40)","v":11},{"$f":"IF(SUMPRODUCT(N(SRP!$M40:'SRP'!$P40<>\"\"))=0,\"\",SRP!O40)","v":12},{"$f":"IF(SUMPRODUCT(N(SRP!$M40:'SRP'!$P40<>\"\"))=0,\"\",SRP!P40)","v":9},{"$f":"IF(SUMPRODUCT(N(SRP!$Q40:'SRP'!$X40<>\"\"))=0,\"\",SRP!Q40)","v":8},{"$f":"IF(SUMPRODUCT(N(SRP!$Q40:'SRP'!$X40<>\"\"))=0,\"\",SRP!R40)","v":10},{"$f":"IF(SUMPRODUCT(N(SRP!$Q40:'SRP'!$X40<>\"\"))=0,\"\",SRP!S40)","v":8},{"$f":"IF(SUMPRODUCT(N(SRP!$Q40:'SRP'!$X40<>\"\"))=0,\"\",SRP!T40)","v":8},{"$f":"IF(SUMPRODUCT(N(SRP!$Q40:'SRP'!$X40<>\"\"))=0,\"\",SRP!U40)","v":6},{"$f":"IF(SUMPRODUCT(N(SRP!$Q40:'SRP'!$X40<>\"\"))=0,\"\",SRP!V40)","v":8},{"$f":"IF(SUMPRODUCT(N(SRP!$Q40:'SRP'!$X40<>\"\"))=0,\"\",SRP!W40)","v":8},{"$f":"IF(SUMPRODUCT(N(SRP!$Q40:'SRP'!$X40<>\"\"))=0,\"\",SRP!X40)","v":8},{"$f":"IF(SUMPRODUCT(N(SRP!Y40<>\"\"))=0,\"\",ROUND(SRP!Y40, 2))","v":25},{"$f":"IF(SUMPRODUCT(N(SRP!Z40<>\"\"))=0,\"\",ROUND(SRP!Z40, 2))","v":24.17},{"$f":"IF(SUMPRODUCT(N(SRP!AA40<>\"\"))=0,\"\",ROUND(SRP!AA40, 2))","v":24.43},{"$f":"IF(SUMPRODUCT(N(SRP!AB40<>\"\"))=0,\"\",ROUND(SRP!AB40, 2))","v":20},{"$f":"IF(SUMPRODUCT(N(SRP!AL40<>\"\"))=0,\"\",SRP!AL40)","v":1}]
[null,null,null,null,null,{"$f":"IF(SRP!B41<>\"\",ROW(F24)-2,\"\")","v":22},{"$f":"IF(SUMPRODUCT(N(SRP!$C41<>\"\"))=0,\"\",SRP!C41)","v":"m"},{"$f":"IF(SUMPRODUCT(N(SRP!$D41<>\"\"))=0,\"\",SRP!D41)","v":"RG"},{"$f":"IF(SUMPRODUCT(N(SRP!$E41:'SRP'!$H41<>\"\"))=0,\"\",SRP!E41)","v":6},{"$f":"IF(SUMPRODUCT(N(SRP!$E41:'SRP'!$H41<>\"\"))=0,\"\",SRP!F41)","v":6},{"$f":"IF(SUMPRODUCT(N(SRP!$E41:'SRP'!$H41<>\"\"))=0,\"\",SRP!G41)","v":6},{"$f":"IF(SUMPRODUCT(N(SRP!$E41:'SRP'!$H41<>\"\"))=0,\"\",SRP!H41)","v":6},{"$f":"IF(SUMPRODUCT(N(SRP!$I41:'SRP'!$L41<>\"\"))=0,\"\",SRP!I41)","v":7},{"$f":"IF(SUMPRODUCT(N(SRP!$I41:'SRP'!$L41<>\"\"))=0,\"\",SRP!J41)","v":7},{"$f":"IF(SUMPRODUCT(N(SRP!$I41:'SRP'!$L41<>\"\"))=0,\"\",SRP!K41)","v":7},{"$f":"IF(SUMPRODUCT(N(SRP!$I41:'SRP'!$L41<>\"\"))=0,\"\",SRP!L41)","v":9},{"$f":"IF(SUMPRODUCT(N(SRP!$M41:'SRP'!$P41<>\"\"))=0,\"\",SRP!M41)","v":11},{"$f":"IF(SUMPRODUCT(N(SRP!$M41:'SRP'!$P41<>\"\"))=0,\"\",SRP!N41)","v":11},{"$f":"IF(SUMPRODUCT(N(SRP!$M41:'SRP'!$P41<>\"\"))=0,\"\",SRP!O41)","v":13},{"$f":"IF(SUMPRODUCT(N(SRP!$M41:'SRP'!$P41<>\"\"))=0,\"\",SRP!P41)","v":7},{"$f":"IF(SUMPRODUCT(N(SRP!$Q41:'SRP'!$X41<>\"\"))=0,\"\",SRP!Q41)","v":10},{"$f":"IF(SUMPRODUCT(N(SRP!$Q41:'SRP'!$X41<>\"\"))=0,\"\",SRP!R41)","v":10},{"$f":"IF(SUMPRODUCT(N(SRP!$Q41:'SRP'!$X41<>\"\"))=0,\"\",SRP!S41)","v":10},{"$f":"IF(SUMPRODUCT(N(SRP!$Q41:'SRP'!$X41<>\"\"))=0,\"\",SRP!T41)","v":10},{"$f":"IF(SUMPRODUCT(N(SRP!$Q41:'SRP'!$X41<>\"\"))=0,\"\",SRP!U41)","v":10},{"$f":"IF(SUMPRODUCT(N(SRP!$Q41:'SRP'!$X41<>\"\"))=0,\"\",SRP!V41)","v":10},{"$f":"IF(SUMPRODUCT(N(SRP!$Q41:'SRP'!$X41<>\"\"))=0,\"\",SRP!W41)","v":10},{"$f":"IF(SUMPRODUCT(N(SRP!$Q41:'SRP'!$X41<>\"\"))=0,\"\",SRP!X41)","v":10},{"$f":"IF(SUMPRODUCT(N(SRP!Y41<>\"\"))=0,\"\",ROUND(SRP!Y41, 2))","v":25},{"$f":"IF(SUMPRODUCT(N(SRP!Z41<>\"\"))=0,\"\",ROUND(SRP!Z41, 2))","v":25},{"$f":"IF(SUMPRODUCT(N(SRP!AA41<>\"\"))=0,\"\",ROUND(SRP!AA41, 2))","v":23.86},{"$f":"IF(SUMPRODUCT(N(SRP!AB41<>\"\"))=0,\"\",ROUND(SRP!AB41, 2))","v":25},{"$f":"IF(SUMPRODUCT(N(SRP!AL41<>\"\"))=0,\"\",SRP!AL41)","v":1}]
[null,null,null,null,null,{"$f":"IF(SRP!B42<>\"\",ROW(F25)-2,\"\")","v":""},{"$f":"IF(SUMPRODUCT(N(SRP!$C42<>\"\"))=0,\"\",SRP!C42)","v":""},{"$f":"IF(SUMPRODUCT(N(SRP!$D42<>\"\"))=0,\"\",SRP!D42)","v":""},{"$f":"IF(SUMPRODUCT(N(SRP!$E42:'SRP'!$H42<>\"\"))=0,\"\",SRP!E42)","v":""},{"$f":"IF(SUMPRODUCT(N(SRP!$E42:'SRP'!$H42<>\"\"))=0,\"\",SRP!F42)","v":""},{"$f":"IF(SUMPRODUCT(N(SRP!$E42:'SRP'!$H42<>\"\"))=0,\"\",SRP!G42)","v":""},{"$f":"IF(SUMPRODUCT(N(SRP!$E42:'SRP'!$H42<>\"\"))=0,\"\",SRP!H42)","v":""},{"$f":"IF(SUMPRODUCT(N(SRP!$I42:'SRP'!$L42<>\"\"))=0,\"\",SRP!I42)","v":""},{"$f":"IF(SUMPRODUCT(N(SRP!$I42:'SRP'!$L42<>\"\"))=0,\"\",SRP!J42)","v":""},{"$f":"IF(SUMPRODUCT(N(SRP!$I42:'SRP'!$L42<>\"\"))=0,\"\",SRP!K42)","v":""},{"$f":"IF(SUMPRODUCT(N(SRP!$I42:'SRP'!$L42<>\"\"))=0,\"\",SRP!L42)","v":""},{"$f":"IF(SUMPRODUCT(N(SRP!$M42:'SRP'!$P42<>\"\"))=0,\"\",SRP!M42)","v":""},{"$f":"IF(SUMPRODUCT(N(SRP!$M42:'SRP'!$P42<>\"\"))=0,\"\",SRP!N42)","v":""},{"$f":"IF(SUMPRODUCT(N(SRP!$M42:'SRP'!$P42<>\"\"))=0,\"\",SRP!O42)","v":""},{"$f":"IF(SUMPRODUCT(N(SRP!$M42:'SRP'!$P42<>\"\"))=0,\"\",SRP!P42)","v":""},{"$f":"IF(SUMPRODUCT(N(SRP!$Q42:'SRP'!$X42<>\"\"))=0,\"\",SRP!Q42)","v":""},{"$f":"IF(SUMPRODUCT(N(SRP!$Q42:'SRP'!$X42<>\"\"))=0,\"\",SRP!R42)","v":""},{"$f":"IF(SUMPRODUCT(N(SRP!$Q42:'SRP'!$X42<>\"\"))=0,\"\",SRP!S42)","v":""},{"$f":"IF(SUMPRODUCT(N(SRP!$Q42:'SRP'!$X42<>\"\"))=0,\"\",SRP!T42)","v":""},{"$f":"IF(SUMPRODUCT(N(SRP!$Q42:'SRP'!$X42<>\"\"))=0,\"\",SRP!U42)","v":""},{"$f":"IF(SUMPRODUCT(N(SRP!$Q42:'SRP'!$X42<>\"\"))=0,\"\",SRP!V42)","v":""},{"$f":"IF(SUMPRODUCT(N(SRP!$Q42:'SRP'!$X42<>\"\"))=0,\"\",SRP!W42)","v":""},{"$f":"IF(SUMPRODUCT(N(SRP!$Q42:'SRP'!$X42<>\"\"))=0,\"\",SRP!X42)","v":""},{"$f":"IF(SUMPRODUCT(N(SRP!Y42<>\"\"))=0,\"\",ROUND(SRP!Y42, 2))","v":""},{"$f":"IF(SUMPRODUCT(N(SRP!Z42<>\"\"))=0,\"\",ROUND(SRP!Z42, 2))","v":""},{"$f":"IF(SUMPRODUCT(N(SRP!AA42<>\"\"))=0,\"\",ROUND(SRP!AA42, 2))","v":""},{"$f":"IF(SUMPRODUCT(N(SRP!AB42<>\"\"))=0,\"\",ROUND(SRP!AB42, 2))","v":""},{"$f":"IF(SUMPRODUCT(N(SRP!AL42<>\"\"))=0,\"\",SRP!AL42)","v":""}]
[null,null,null,null,null,{"$f":"IF(SRP!B43<>\"\",ROW(F26)-2,\"\")","v":""},{"$f":"IF(SUMPRODUCT(N(SRP!$C43<>\"\"))=0,\"\",SRP!C43)","v":""},{"$f":"IF(SUMPRODUCT(N(SRP!$D43<>\"\"))=0,\"\",SRP!D43)","v":""},{"$f":"IF(SUMPRODUCT(N(SRP!$E43:'SRP'!$H43<>\"\"))=0,\"\",SRP!E43)","v":""},{"$f":"IF(SUMPRODUCT(N(SRP!$E43:'SRP'!$H43<>\"\"))=0,\"\",SRP!F43)","v":""},{"$f":"IF(SUMPRODUCT(N(SRP!$E43:'SRP'!$H43<>\"\"))=0,\"\",SRP!G43)","v":""},{"$f":"IF(SUMPRODUCT(N(SRP!$E43:'SRP'!$H43<>\"\"))=0,\"\",SRP!H43)","v":""},{"$f":"IF(SUMPRODUCT(N(SRP!$I43:'SRP'!$L43<>\"\"))=0,\"\",SRP!I43)","v":""},{"$f":"IF(SUMPRODUCT(N(SRP!$I43:'SRP'!$L43<>\"\"))=0,\"\",SRP!J43)","v":""},{"$f":"IF(SUMPRODUCT(N(SRP!$I43:'SRP'!$L43<>\"\"))=0,\"\",SRP!K43)","v":""},{"$f":"IF(SUMPRODUCT(N(SRP!$I43:'SRP'!$L43<>\"\"))=0,\"\",SRP!L43)","v":""},{"$f":"IF(SUMPRODUCT(N(SRP!$M43:'SRP'!$P43<>\"\"))=0,\"\",SRP!M43)","v":""},{"$f":"IF(SUMPRODUCT(N(SRP!$M43:'SRP'!$P43<>\"\"))=0,\"\",SRP!N43)","v":""},{"$f":"IF(SUMPRODUCT(N(SRP!$M43:'SRP'!$P43<>\"\"))=0,\"\",SRP!O43)","v":""},{"$f":"IF(SUMPRODUCT(N(SRP!$M43:'SRP'!$P43<>\"\"))=0,\"\",SRP!P43)","v":""},{"$f":"IF(SUMPRODUCT(N(SRP!$Q43:'SRP'!$X43<>\"\"))=0,\"\",SRP!Q43)","v":""},{"$f":"IF(SUMPRODUCT(N(SRP!$Q43:'SRP'!$X43<>\"\"))=0,\"\",SRP!R43)","v":""},{"$f":"IF(SUMPRODUCT(N(SRP!$Q43:'SRP'!$X43<>\"\"))=0,\"\",SRP!S43)","v":""},{"$f":"IF(SUMPRODUCT(N(SRP!$Q43:'SRP'!$X43<>\"\"))=0,\"\",SRP!T43)","v":""},{"$f":"IF(SUMPRODUCT(N(SRP!$Q43:'SRP'!$X43<>\"\"))=0,\"\",SRP!U43)","v":""},{"$f":"IF(SUMPRODUCT(N(SRP!$Q43:'SRP'!$X43<>\"\"))=0,\"\",SRP!V43)","v":""},{"$f":"IF(SUMPRODUCT(N(SRP!$Q43:'SRP'!$X43<>\"\"))=0,\"\",SRP!W43)","v":""},{"$f":"IF(SUMPRODUCT(N(SRP!$Q43:'SRP'!$X43<>\"\"))=0,\"\",SRP!X43)","v":""},{"$f":"IF(SUMPRODUCT(N(SRP!Y43<>\"\"))=0,\"\",ROUND(SRP!Y43, 2))","v":""},{"$f":"IF(SUMPRODUCT(N(SRP!Z43<>\"\"))=0,\"\",ROUND(SRP!Z43, 2))","v":""},{"$f":"IF(SUMPRODUCT(N(SRP!AA43<>\"\"))=0,\"\",ROUND(SRP!AA43, 2))","v":""},{"$f":"IF(SUMPRODUCT(N(SRP!AB43<>\"\"))=0,\"\",ROUND(SRP!AB43, 2))","v":""},{"$f":"IF(SUMPRODUCT(N(SRP!AL43<>\"\"))=0,\"\",SRP!AL43)","v":""}]
[null,null,null,null,null,{"$f":"IF(SRP!B44<>\"\",ROW(F27)-2,\"\")","v":""},{"$f":"IF(SUMPRODUCT(N(SRP!$C44<>\"\"))=0,\"\",SRP!C44)","v":""},{"$f":"IF(SUMPRODUCT(N(SRP!$D44<>\"\"))=0,\"\",SRP!D44)","v":""},{"$f":"IF(SUMPRODUCT(N(SRP!$E44:'SRP'!$H44<>\"\"))=0,\"\",SRP!E44)","v":""},{"$f":"IF(SUMPRODUCT(N(SRP!$E44:'SRP'!$H44<>\"\"))=0,\"\",SRP!F44)","v":""},{"$f":"IF(SUMPRODUCT(N(SRP!$E44:'SRP'!$H44<>\"\"))=0,\"\",SRP!G44)","v":""},{"$f":"IF(SUMPRODUCT(N(SRP!$E44:'SRP'!$H44<>\"\"))=0,\"\",SRP!H44)","v":""},{"$f":"IF(SUMPRODUCT(N(SRP!$I44:'SRP'!$L44<>\"\"))=0,\"\",SRP!I44)","v":""},{"$f":"IF(SUMPRODUCT(N(SRP!$I44:'SRP'!$L44<>\"\"))=0,\"\",SRP!J44)","v":""},{"$f":"IF(SUMPRODUCT(N(SRP!$I44:'SRP'!$L44<>\"\"))=0,\"\",SRP!K44)","v":""},{"$f":"IF(SUMPRODUCT(N(SRP!$I44:'SRP'!$L44<>\"\"))=0,\"\",SRP!L44)","v":""},{"$f":"IF(SUMPRODUCT(N(SRP!$M44:'SRP'!$P44<>\"\"))=0,\"\",SRP!M44)","v":""},{"$f":"IF(SUMPRODUCT(N(SRP!$M44:'SRP'!$P44<>\"\"))=0,\"\",SRP!N44)","v":""},{"$f":"IF(SUMPRODUCT(N(SRP!$M44:'SRP'!$P44<>\"\"))=0,\"\",SRP!O44)","v":""},{"$f":"IF(SUMPRODUCT(N(SRP!$M44:'SRP'!$P44<>\"\"))=0,\"\",SRP!P44)","v":""},{"$f":"IF(SUMPRODUCT(N(SRP!$Q44:'SRP'!$X44<>\"\"))=0,\"\",SRP!Q44)","v":""},{"$f":"IF(SUMPRODUCT(N(SRP!$Q44:'SRP'!$X44<>\"\"))=0,\"\",SRP!R44)","v":""},{"$f":"IF(SUMPRODUCT(N(SRP!$Q44:'SRP'!$X44<>\"\"))=0,\"\",SRP!S44)","v":""},{"$f":"IF(SUMPRODUCT(N(SRP!$Q44:'SRP'!$X44<>\"\"))=0,\"\",SRP!T44)","v":""},{"$f":"IF(SUMPRODUCT(N(SRP!$Q44:'SRP'!$X44<>\"\"))=0,\"\",SRP!U44)","v":""},{"$f":"IF(SUMPRODUCT(N(SRP!$Q44:'SRP'!$X44<>\"\"))=0,\"\",SRP!V44)","v":""},{"$f":"IF(SUMPRODUCT(N(SRP!$Q44:'SRP'!$X44<>\"\"))=0,\"\",SRP!W44)","v":""},{"$f":"IF(SUMPRODUCT(N(SRP!$Q44:'SRP'!$X44<>\"\"))=0,\"\",SRP!X44)","v":""},{"$f":"IF(SUMPRODUCT(N(SRP!Y44<>\"\"))=0,\"\",ROUND(SRP!Y44, 2))","v":""},{"$f":"IF(SUMPRODUCT(N(SRP!Z44<>\"\"))=0,\"\",ROUND(SRP!Z44, 2))","v":""},{"$f":"IF(SUMPRODUCT(N(SRP!AA44<>\"\"))=0,\"\",ROUND(SRP!AA44, 2))","v":""},{"$f":"IF(SUMPRODUCT(N(SRP!AB44<>\"\"))=0,\"\",ROUND(SRP!AB44, 2))","v":""},{"$f":"IF(SUMPRODUCT(N(SRP!AL44<>\"\"))=0,\"\",SRP!AL44)","v":""}]
[null,null,null,null,null,{"$f":"IF(SRP!B45<>\"\",ROW(F28)-2,\"\")","v":""},{"$f":"IF(SUMPRODUCT(N(SRP!$C45<>\"\"))=0,\"\",SRP!C45)","v":""},{"$f":"IF(SUMPRODUCT(N(SRP!$D45<>\"\"))=0,\"\",SRP!D45)","v":""},{"$f":"IF(SUMPRODUCT(N(SRP!$E45:'SRP'!$H45<>\"\"))=0,\"\",SRP!E45)","v":""},{"$f":"IF(SUMPRODUCT(N(SRP!$E45:'SRP'!$H45<>\"\"))=0,\"\",SRP!F45)","v":""},{"$f":"IF(SUMPRODUCT(N(SRP!$E45:'SRP'!$H45<>\"\"))=0,\"\",SRP!G45)","v":""},{"$f":"IF(SUMPRODUCT(N(SRP!$E45:'SRP'!$H45<>\"\"))=0,\"\",SRP!H45)","v":""},{"$f":"IF(SUMPRODUCT(N(SRP!$I45:'SRP'!$L45<>\"\"))=0,\"\",SRP!I45)","v":""},{"$f":"IF(SUMPRODUCT(N(SRP!$I45:'SRP'!$L45<>\"\"))=0,\"\",SRP!J45)","v":""},{"$f":"IF(SUMPRODUCT(N(SRP!$I45:'SRP'!$L45<>\"\"))=0,\"\",SRP!K45)","v":""},{"$f":"IF(SUMPRODUCT(N(SRP!$I45:'SRP'!$L45<>\"\"))=0,\"\",SRP!L45)","v":""},{"$f":"IF(SUMPRODUCT(N(SRP!$M45:'SRP'!$P45<>\"\"))=0,\"\",SRP!M45)","v":""},{"$f":"IF(SUMPRODUCT(N(SRP!$M45:'SRP'!$P45<>\"\"))=0,\"\",SRP!N45)","v":""},{"$f":"IF(SUMPRODUCT(N(SRP!$M45:'SRP'!$P45<>\"\"))=0,\"\",SRP!O45)","v":""},{"$f":"IF(SUMPRODUCT(N(SRP!$M45:'SRP'!$P45<>\"\"))=0,\"\",SRP!P45)","v":""},{"$f":"IF(SUMPRODUCT(N(SRP!$Q45:'SRP'!$X45<>\"\"))=0,\"\",SRP!Q45)","v":""},{"$f":"IF(SUMPRODUCT(N(SRP!$Q45:'SRP'!$X45<>\"\"))=0,\"\",SRP!R45)","v":""},{"$f":"IF(SUMPRODUCT(N(SRP!$Q45:'SRP'!$X45<>\"\"))=0,\"\",SRP!S45)","v":""},{"$f":"IF(SUMPRODUCT(N(SRP!$Q45:'SRP'!$X45<>\"\"))=0,\"\",SRP!T45)","v":""},{"$f":"IF(SUMPRODUCT(N(SRP!$Q45:'SRP'!$X45<>\"\"))=0,\"\",SRP!U45)","v":""},{"$f":"IF(SUMPRODUCT(N(SRP!$Q45:'SRP'!$X45<>\"\"))=0,\"\",SRP!V45)","v":""},{"$f":"IF(SUMPRODUCT(N(SRP!$Q45:'SRP'!$X45<>\"\"))=0,\"\",SRP!W45)","v":""},{"$f":"IF(SUMPRODUCT(N(SRP!$Q45:'SRP'!$X45<>\"\"))=0,\"\",SRP!X45)","v":""},{"$f":"IF(SUMPRODUCT(N(SRP!Y45<>\"\"))=0,\"\",ROUND(SRP!Y45, 2))","v":""},{"$f":"IF(SUMPRODUCT(N(SRP!Z45<>\"\"))=0,\"\",ROUND(SRP!Z45, 2))","v":""},{"$f":"IF(SUMPRODUCT(N(SRP!AA45<>\"\"))=0,\"\",ROUND(SRP!AA45, 2))","v":""},{"$f":"IF(SUMPRODUCT(N(SRP!AB45<>\"\"))=0,\"\",ROUND(SRP!AB45, 2))","v":""},{"$f":"IF(SUMPRODUCT(N(SRP!AL45<>\"\"))=0,\"\",SRP!AL45)","v":""}]
[null,null,null,null,null,{"$f":"IF(SRP!B46<>\"\",ROW(F29)-2,\"\")","v":""},{"$f":"IF(SUMPRODUCT(N(SRP!$C46<>\"\"))=0,\"\",SRP!C46)","v":""},{"$f":"IF(SUMPRODUCT(N(SRP!$D46<>\"\"))=0,\"\",SRP!D46)","v":""},{"$f":"IF(SUMPRODUCT(N(SRP!$E46:'SRP'!$H46<>\"\"))=0,\"\",SRP!E46)","v":""},{"$f":"IF(SUMPRODUCT(N(SRP!$E46:'SRP'!$H46<>\"\"))=0,\"\",SRP!F46)","v":""},{"$f":"IF(SUMPRODUCT(N(SRP!$E46:'SRP'!$H46<>\"\"))=0,\"\",SRP!G46)","v":""},{"$f":"IF(SUMPRODUCT(N(SRP!$E46:'SRP'!$H46<>\"\"))=0,\"\",SRP!H46)","v":""},{"$f":"IF(SUMPRODUCT(N(SRP!$I46:'SRP'!$L46<>\"\"))=0,\"\",SRP!I46)","v":""},{"$f":"IF(SUMPRODUCT(N(SRP!$I46:'SRP'!$L46<>\"\"))=0,\"\",SRP!J46)","v":""},{"$f":"IF(SUMPRODUCT(N(SRP!$I46:'SRP'!$L46<>\"\"))=0,\"\",SRP!K46)","v":""},{"$f":"IF(SUMPRODUCT(N(SRP!$I46:'SRP'!$L46<>\"\"))=0,\"\",SRP!L46)","v":""},{"$f":"IF(SUMPRODUCT(N(SRP!$M46:'SRP'!$P46<>\"\"))=0,\"\",SRP!M46)","v":""},{"$f":"IF(SUMPRODUCT(N(SRP!$M46:'SRP'!$P46<>\"\"))=0,\"\",SRP!N46)","v":""},{"$f":"IF(SUMPRODUCT(N(SRP!$M46:'SRP'!$P46<>\"\"))=0,\"\",SRP!O46)","v":""},{"$f":"IF(SUMPRODUCT(N(SRP!$M46:'SRP'!$P46<>\"\"))=0,\"\",SRP!P46)","v":""},{"$f":"IF(SUMPRODUCT(N(SRP!$Q46:'SRP'!$X46<>\"\"))=0,\"\",SRP!Q46)","v":""},{"$f":"IF(SUMPRODUCT(N(SRP!$Q46:'SRP'!$X46<>\"\"))=0,\"\",SRP!R46)","v":""},{"$f":"IF(SUMPRODUCT(N(SRP!$Q46:'SRP'!$X46<>\"\"))=0,\"\",SRP!S46)","v":""},{"$f":"IF(SUMPRODUCT(N(SRP!$Q46:'SRP'!$X46<>\"\"))=0,\"\",SRP!T46)","v":""},{"$f":"IF(SUMPRODUCT(N(SRP!$Q46:'SRP'!$X46<>\"\"))=0,\"\",SRP!U46)","v":""},{"$f":"IF(SUMPRODUCT(N(SRP!$Q46:'SRP'!$X46<>\"\"))=0,\"\",SRP!V46)","v":""},{"$f":"IF(SUMPRODUCT(N(SRP!$Q46:'SRP'!$X46<>\"\"))=0,\"\",SRP!W46)","v":""},{"$f":"IF(SUMPRODUCT(N(SRP!$Q46:'SRP'!$X46<>\"\"))=0,\"\",SRP!X46)","v":""},{"$f":"IF(SUMPRODUCT(N(SRP!Y46<>\"\"))=0,\"\",ROUND(SRP!Y46, 2))","v":""},{"$f":"IF(SUMPRODUCT(N(SRP!Z46<>\"\"))=0,\"\",ROUND(SRP!Z46, 2))","v":""},{"$f":"IF(SUMPRODUCT(N(SRP!AA46<>\"\"))=0,\"\",ROUND(SRP!AA46, 2))","v":""},{"$f":"IF(SUMPRODUCT(N(SRP!AB46<>\"\"))=0,\"\",ROUND(SRP!AB46, 2))","v":""},{"$f":"IF(SUMPRODUCT(N(SRP!AL46<>\"\"))=0,\"\",SRP!AL46)","v":""}]
[null,null,null,null,null,{"$f":"IF(SRP!B47<>\"\",ROW(F30)-2,\"\")","v":""},{"$f":"IF(SUMPRODUCT(N(SRP!$C47<>\"\"))=0,\"\",SRP!C47)","v":""},{"$f":"IF(SUMPRODUCT(N(SRP!$D47<>\"\"))=0,\"\",SRP!D47)","v":""},{"$f":"IF(SUMPRODUCT(N(SRP!$E47:'SRP'!$H47<>\"\"))=0,\"\",SRP!E47)","v":""},{"$f":"IF(SUMPRODUCT(N(SRP!$E47:'SRP'!$H47<>\"\"))=0,\"\",SRP!F47)","v":""},{"$f":"IF(SUMPRODUCT(N(SRP!$E47:'SRP'!$H47<>\"\"))=0,\"\",SRP!G47)","v":""},{"$f":"IF(SUMPRODUCT(N(SRP!$E47:'SRP'!$H47<>\"\"))=0,\"\",SRP!H47)","v":""},{"$f":"IF(SUMPRODUCT(N(SRP!$I47:'SRP'!$L47<>\"\"))=0,\"\",SRP!I47)","v":""},{"$f":"IF(SUMPRODUCT(N(SRP!$I47:'SRP'!$L47<>\"\"))=0,\"\",SRP!J47)","v":""},{"$f":"IF(SUMPRODUCT(N(SRP!$I47:'SRP'!$L47<>\"\"))=0,\"\",SRP!K47)","v":""},{"$f":"IF(SUMPRODUCT(N(SRP!$I47:'SRP'!$L47<>\"\"))=0,\"\",SRP!L47)","v":""},{"$f":"IF(SUMPRODUCT(N(SRP!$M47:'SRP'!$P47<>\"\"))=0,\"\",SRP!M47)","v":""},{"$f":"IF(SUMPRODUCT(N(SRP!$M47:'SRP'!$P47<>\"\"))=0,\"\",SRP!N47)","v":""},{"$f":"IF(SUMPRODUCT(N(SRP!$M47:'SRP'!$P47<>\"\"))=0,\"\",SRP!O47)","v":""},{"$f":"IF(SUMPRODUCT(N(SRP!$M47:'SRP'!$P47<>\"\"))=0,\"\",SRP!P47)","v":""},{"$f":"IF(SUMPRODUCT(N(SRP!$Q47:'SRP'!$X47<>\"\"))=0,\"\",SRP!Q47)","v":""},{"$f":"IF(SUMPRODUCT(N(SRP!$Q47:'SRP'!$X47<>\"\"))=0,\"\",SRP!R47)","v":""},{"$f":"IF(SUMPRODUCT(N(SRP!$Q47:'SRP'!$X47<>\"\"))=0,\"\",SRP!S47)","v":""},{"$f":"IF(SUMPRODUCT(N(SRP!$Q47:'SRP'!$X47<>\"\"))=0,\"\",SRP!T47)","v":""},{"$f":"IF(SUMPRODUCT(N(SRP!$Q47:'SRP'!$X47<>\"\"))=0,\"\",SRP!U47)","v":""},{"$f":"IF(SUMPRODUCT(N(SRP!$Q47:'SRP'!$X47<>\"\"))=0,\"\",SRP!V47)","v":""},{"$f":"IF(SUMPRODUCT(N(SRP!$Q47:'SRP'!$X47<>\"\"))=0,\"\",SRP!W47)","v":""},{"$f":"IF(SUMPRODUCT(N(SRP!$Q47:'SRP'!$X47<>\"\"))=0,\"\",SRP!X47)","v":""},{"$f":"IF(SUMPRODUCT(N(SRP!Y47<>\"\"))=0,\"\",ROUND(SRP!Y47, 2))","v":""},{"$f":"IF(SUMPRODUCT(N(SRP!Z47<>\"\"))=0,\"\",ROUND(SRP!Z47, 2))","v":""},{"$f":"IF(SUMPRODUCT(N(SRP!AA47<>\"\"))=0,\"\",ROUND(SRP!AA47, 2))","v":""},{"$f":"IF(SUMPRODUCT(N(SRP!AB47<>\"\"))=0,\"\",ROUND(SRP!AB47, 2))","v":""},{"$f":"IF(SUMPRODUCT(N(SRP!AL47<>\"\"))=0,\"\",SRP!AL47)","v":""}]
[null,null,null,null,null,{"$f":"IF(SRP!B48<>\"\",ROW(F31)-2,\"\")","v":""},{"$f":"IF(SUMPRODUCT(N(SRP!$C48<>\"\"))=0,\"\",SRP!C48)","v":""},{"$f":"IF(SUMPRODUCT(N(SRP!$D48<>\"\"))=0,\"\",SRP!D48)","v":""},{"$f":"IF(SUMPRODUCT(N(SRP!$E48:'SRP'!$H48<>\"\"))=0,\"\",SRP!E48)","v":""},{"$f":"IF(SUMPRODUCT(N(SRP!$E48:'SRP'!$H48<>\"\"))=0,\"\",SRP!F48)","v":""},{"$f":"IF(SUMPRODUCT(N(SRP!$E48:'SRP'!$H48<>\"\"))=0,\"\",SRP!G48)","v":""},{"$f":"IF(SUMPRODUCT(N(SRP!$E48:'SRP'!$H48<>\"\"))=0,\"\",SRP!H48)","v":""},{"$f":"IF(SUMPRODUCT(N(SRP!$I48:'SRP'!$L48<>\"\"))=0,\"\",SRP!I48)","v":""},{"$f":"IF(SUMPRODUCT(N(SRP!$I48:'SRP'!$L48<>\"\"))=0,\"\",SRP!J48)","v":""},{"$f":"IF(SUMPRODUCT(N(SRP!$I48:'SRP'!$L48<>\"\"))=0,\"\",SRP!K48)","v":""},{"$f":"IF(SUMPRODUCT(N(SRP!$I48:'SRP'!$L48<>\"\"))=0,\"\",SRP!L48)","v":""},{"$f":"IF(SUMPRODUCT(N(SRP!$M48:'SRP'!$P48<>\"\"))=0,\"\",SRP!M48)","v":""},{"$f":"IF(SUMPRODUCT(N(SRP!$M48:'SRP'!$P48<>\"\"))=0,\"\",SRP!N48)","v":""},{"$f":"IF(SUMPRODUCT(N(SRP!$M48:'SRP'!$P48<>\"\"))=0,\"\",SRP!O48)","v":""},{"$f":"IF(SUMPRODUCT(N(SRP!$M48:'SRP'!$P48<>\"\"))=0,\"\",SRP!P48)","v":""},{"$f":"IF(SUMPRODUCT(N(SRP!$Q48:'SRP'!$X48<>\"\"))=0,\"\",SRP!Q48)","v":""},{"$f":"IF(SUMPRODUCT(N(SRP!$Q48:'SRP'!$X48<>\"\"))=0,\"\",SRP!R48)","v":""},{"$f":"IF(SUMPRODUCT(N(SRP!$Q48:'SRP'!$X48<>\"\"))=0,\"\",SRP!S48)","v":""},{"$f":"IF(SUMPRODUCT(N(SRP!$Q48:'SRP'!$X48<>\"\"))=0,\"\",SRP!T48)","v":""},{"$f":"IF(SUMPRODUCT(N(SRP!$Q48:'SRP'!$X48<>\"\"))=0,\"\",SRP!U48)","v":""},{"$f":"IF(SUMPRODUCT(N(SRP!$Q48:'SRP'!$X48<>\"\"))=0,\"\",SRP!V48)","v":""},{"$f":"IF(SUMPRODUCT(N(SRP!$Q48:'SRP'!$X48<>\"\"))=0,\"\",SRP!W48)","v":""},{"$f":"IF(SUMPRODUCT(N(SRP!$Q48:'SRP'!$X48<>\"\"))=0,\"\",SRP!X48)","v":""},{"$f":"IF(SUMPRODUCT(N(SRP!Y48<>\"\"))=0,\"\",ROUND(SRP!Y48, 2))","v":""},{"$f":"IF(SUMPRODUCT(N(SRP!Z48<>\"\"))=0,\"\",ROUND(SRP!Z48, 2))","v":""},{"$f":"IF(SUMPRODUCT(N(SRP!AA48<>\"\"))=0,\"\",ROUND(SRP!AA48, 2))","v":""},{"$f":"IF(SUMPRODUCT(N(SRP!AB48<>\"\"))=0,\"\",ROUND(SRP!AB48, 2))","v":""},{"$f":"IF(SUMPRODUCT(N(SRP!AL48<>\"\"))=0,\"\",SRP!AL48)","v":""}]
[null,null,null,null,null,{"$f":"IF(SRP!B49<>\"\",ROW(F32)-2,\"\")","v":""},{"$f":"IF(SUMPRODUCT(N(SRP!$C49<>\"\"))=0,\"\",SRP!C49)","v":""},{"$f":"IF(SUMPRODUCT(N(SRP!$D49<>\"\"))=0,\"\",SRP!D49)","v":""},{"$f":"IF(SUMPRODUCT(N(SRP!$E49:'SRP'!$H49<>\"\"))=0,\"\",SRP!E49)","v":""},{"$f":"IF(SUMPRODUCT(N(SRP!$E49:'SRP'!$H49<>\"\"))=0,\"\",SRP!F49)","v":""},{"$f":"IF(SUMPRODUCT(N(SRP!$E49:'SRP'!$H49<>\"\"))=0,\"\",SRP!G49)","v":""},{"$f":"IF(SUMPRODUCT(N(SRP!$E49:'SRP'!$H49<>\"\"))=0,\"\",SRP!H49)","v":""},{"$f":"IF(SUMPRODUCT(N(SRP!$I49:'SRP'!$L49<>\"\"))=0,\"\",SRP!I49)","v":""},{"$f":"IF(SUMPRODUCT(N(SRP!$I49:'SRP'!$L49<>\"\"))=0,\"\",SRP!J49)","v":""},{"$f":"IF(SUMPRODUCT(N(SRP!$I49:'SRP'!$L49<>\"\"))=0,\"\",SRP!K49)","v":""},{"$f":"IF(SUMPRODUCT(N(SRP!$I49:'SRP'!$L49<>\"\"))=0,\"\",SRP!L49)","v":""},{"$f":"IF(SUMPRODUCT(N(SRP!$M49:'SRP'!$P49<>\"\"))=0,\"\",SRP!M49)","v":""},{"$f":"IF(SUMPRODUCT(N(SRP!$M49:'SRP'!$P49<>\"\"))=0,\"\",SRP!N49)","v":""},{"$f":"IF(SUMPRODUCT(N(SRP!$M49:'SRP'!$P49<>\"\"))=0,\"\",SRP!O49)","v":""},{"$f":"IF(SUMPRODUCT(N(SRP!$M49:'SRP'!$P49<>\"\"))=0,\"\",SRP!P49)","v":""},{"$f":"IF(SUMPRODUCT(N(SRP!$Q49:'SRP'!$X49<>\"\"))=0,\"\",SRP!Q49)","v":""},{"$f":"IF(SUMPRODUCT(N(SRP!$Q49:'SRP'!$X49<>\"\"))=0,\"\",SRP!R49)","v":""},{"$f":"IF(SUMPRODUCT(N(SRP!$Q49:'SRP'!$X49<>\"\"))=0,\"\",SRP!S49)","v":""},{"$f":"IF(SUMPRODUCT(N(SRP!$Q49:'SRP'!$X49<>\"\"))=0,\"\",SRP!T49)","v":""},{"$f":"IF(SUMPRODUCT(N(SRP!$Q49:'SRP'!$X49<>\"\"))=0,\"\",SRP!U49)","v":""},{"$f":"IF(SUMPRODUCT(N(SRP!$Q49:'SRP'!$X49<>\"\"))=0,\"\",SRP!V49)","v":""},{"$f":"IF(SUMPRODUCT(N(SRP!$Q49:'SRP'!$X49<>\"\"))=0,\"\",SRP!W49)","v":""},{"$f":"IF(SUMPRODUCT(N(SRP!$Q49:'SRP'!$X49<>\"\"))=0,\"\",SRP!X49)","v":""},{"$f":"IF(SUMPRODUCT(N(SRP!Y49<>\"\"))=0,\"\",ROUND(SRP!Y49, 2))","v":""},{"$f":"IF(SUMPRODUCT(N(SRP!Z49<>\"\"))=0,\"\",ROUND(SRP!Z49, 2))","v":""},{"$f":"IF(SUMPRODUCT(N(SRP!AA49<>\"\"))=0,\"\",ROUND(SRP!AA49, 2))","v":""},{"$f":"IF(SUMPRODUCT(N(SRP!AB49<>\"\"))=0,\"\",ROUND(SRP!AB49, 2))","v":""},{"$f":"IF(SUMPRODUCT(N(SRP!AL49<>\"\"))=0,\"\",SRP!AL49)","v":""}]
[null,null,null,null,null,{"$f":"IF(SRP!B50<>\"\",ROW(F33)-2,\"\")","v":""},{"$f":"IF(SUMPRODUCT(N(SRP!$C50<>\"\"))=0,\"\",SRP!C50)","v":""},{"$f":"IF(SUMPRODUCT(N(SRP!$D50<>\"\"))=0,\"\",SRP!D50)","v":""},{"$f":"IF(SUMPRODUCT(N(SRP!$E50:'SRP'!$H50<>\"\"))=0,\"\",SRP!E50)","v":""},{"$f":"IF(SUMPRODUCT(N(SRP!$E50:'SRP'!$H50<>\"\"))=0,\"\",SRP!F50)","v":""},{"$f":"IF(SUMPRODUCT(N(SRP!$E50:'SRP'!$H50<>\"\"))=0,\"\",SRP!G50)","v":""},{"$f":"IF(SUMPRODUCT(N(SRP!$E50:'SRP'!$H50<>\"\"))=0,\"\",SRP!H50)","v":""},{"$f":"IF(SUMPRODUCT(N(SRP!$I50:'SRP'!$L50<>\"\"))=0,\"\",SRP!I50)","v":""},{"$f":"IF(SUMPRODUCT(N(SRP!$I50:'SRP'!$L50<>\"\"))=0,\"\",SRP!J50)","v":""},{"$f":"IF(SUMPRODUCT(N(SRP!$I50:'SRP'!$L50<>\"\"))=0,\"\",SRP!K50)","v":""},{"$f":"IF(SUMPRODUCT(N(SRP!$I50:'SRP'!$L50<>\"\"))=0,\"\",SRP!L50)","v":""},{"$f":"IF(SUMPRODUCT(N(SRP!$M50:'SRP'!$P50<>\"\"))=0,\"\",SRP!M50)","v":""},{"$f":"IF(SUMPRODUCT(N(SRP!$M50:'SRP'!$P50<>\"\"))=0,\"\",SRP!N50)","v":""},{"$f":"IF(SUMPRODUCT(N(SRP!$M50:'SRP'!$P50<>\"\"))=0,\"\",SRP!O50)","v":""},{"$f":"IF(SUMPRODUCT(N(SRP!$M50:'SRP'!$P50<>\"\"))=0,\"\",SRP!P50)","v":""},{"$f":"IF(SUMPRODUCT(N(SRP!$Q50:'SRP'!$X50<>\"\"))=0,\"\",SRP!Q50)","v":""},{"$f":"IF(SUMPRODUCT(N(SRP!$Q50:'SRP'!$X50<>\"\"))=0,\"\",SRP!R50)","v":""},{"$f":"IF(SUMPRODUCT(N(SRP!$Q50:'SRP'!$X50<>\"\"))=0,\"\",SRP!S50)","v":""},{"$f":"IF(SUMPRODUCT(N(SRP!$Q50:'SRP'!$X50<>\"\"))=0,\"\",SRP!T50)","v":""},{"$f":"IF(SUMPRODUCT(N(SRP!$Q50:'SRP'!$X50<>\"\"))=0,\"\",SRP!U50)","v":""},{"$f":"IF(SUMPRODUCT(N(SRP!$Q50:'SRP'!$X50<>\"\"))=0,\"\",SRP!V50)","v":""},{"$f":"IF(SUMPRODUCT(N(SRP!$Q50:'SRP'!$X50<>\"\"))=0,\"\",SRP!W50)","v":""},{"$f":"IF(SUMPRODUCT(N(SRP!$Q50:'SRP'!$X50<>\"\"))=0,\"\",SRP!X50)","v":""},{"$f":"IF(SUMPRODUCT(N(SRP!Y50<>\"\"))=0,\"\",ROUND(SRP!Y50, 2))","v":""},{"$f":"IF(SUMPRODUCT(N(SRP!Z50<>\"\"))=0,\"\",ROUND(SRP!Z50, 2))","v":""},{"$f":"IF(SUMPRODUCT(N(SRP!AA50<>\"\"))=0,\"\",ROUND(SRP!AA50, 2))","v":""},{"$f":"IF(SUMPRODUCT(N(SRP!AB50<>\"\"))=0,\"\",ROUND(SRP!AB50, 2))","v":""},{"$f":"IF(SUMPRODUCT(N(SRP!AL50<>\"\"))=0,\"\",SRP!AL50)","v":""}]
[null,null,null,null,null,{"$f":"IF(SRP!B51<>\"\",ROW(F34)-2,\"\")","v":""},{"$f":"IF(SUMPRODUCT(N(SRP!$C51<>\"\"))=0,\"\",SRP!C51)","v":""},{"$f":"IF(SUMPRODUCT(N(SRP!$D51<>\"\"))=0,\"\",SRP!D51)","v":""},{"$f":"IF(SUMPRODUCT(N(SRP!$E51:'SRP'!$H51<>\"\"))=0,\"\",SRP!E51)","v":""},{"$f":"IF(SUMPRODUCT(N(SRP!$E51:'SRP'!$H51<>\"\"))=0,\"\",SRP!F51)","v":""},{"$f":"IF(SUMPRODUCT(N(SRP!$E51:'SRP'!$H51<>\"\"))=0,\"\",SRP!G51)","v":""},{"$f":"IF(SUMPRODUCT(N(SRP!$E51:'SRP'!$H51<>\"\"))=0,\"\",SRP!H51)","v":""},{"$f":"IF(SUMPRODUCT(N(SRP!$I51:'SRP'!$L51<>\"\"))=0,\"\",SRP!I51)","v":""},{"$f":"IF(SUMPRODUCT(N(SRP!$I51:'SRP'!$L51<>\"\"))=0,\"\",SRP!J51)","v":""},{"$f":"IF(SUMPRODUCT(N(SRP!$I51:'SRP'!$L51<>\"\"))=0,\"\",SRP!K51)","v":""},{"$f":"IF(SUMPRODUCT(N(SRP!$I51:'SRP'!$L51<>\"\"))=0,\"\",SRP!L51)","v":""},{"$f":"IF(SUMPRODUCT(N(SRP!$M51:'SRP'!$P51<>\"\"))=0,\"\",SRP!M51)","v":""},{"$f":"IF(SUMPRODUCT(N(SRP!$M51:'SRP'!$P51<>\"\"))=0,\"\",SRP!N51)","v":""},{"$f":"IF(SUMPRODUCT(N(SRP!$M51:'SRP'!$P51<>\"\"))=0,\"\",SRP!O51)","v":""},{"$f":"IF(SUMPRODUCT(N(SRP!$M51:'SRP'!$P51<>\"\"))=0,\"\",SRP!P51)","v":""},{"$f":"IF(SUMPRODUCT(N(SRP!$Q51:'SRP'!$X51<>\"\"))=0,\"\",SRP!Q51)","v":""},{"$f":"IF(SUMPRODUCT(N(SRP!$Q51:'SRP'!$X51<>\"\"))=0,\"\",SRP!R51)","v":""},{"$f":"IF(SUMPRODUCT(N(SRP!$Q51:'SRP'!$X51<>\"\"))=0,\"\",SRP!S51)","v":""},{"$f":"IF(SUMPRODUCT(N(SRP!$Q51:'SRP'!$X51<>\"\"))=0,\"\",SRP!T51)","v":""},{"$f":"IF(SUMPRODUCT(N(SRP!$Q51:'SRP'!$X51<>\"\"))=0,\"\",SRP!U51)","v":""},{"$f":"IF(SUMPRODUCT(N(SRP!$Q51:'SRP'!$X51<>\"\"))=0,\"\",SRP!V51)","v":""},{"$f":"IF(SUMPRODUCT(N(SRP!$Q51:'SRP'!$X51<>\"\"))=0,\"\",SRP!W51)","v":""},{"$f":"IF(SUMPRODUCT(N(SRP!$Q51:'SRP'!$X51<>\"\"))=0,\"\",SRP!X51)","v":""},{"$f":"IF(SUMPRODUCT(N(SRP!Y51<>\"\"))=0,\"\",ROUND(SRP!Y51, 2))","v":""},{"$f":"IF(SUMPRODUCT(N(SRP!Z51<>\"\"))=0,\"\",ROUND(SRP!Z51, 2))","v":""},{"$f":"IF(SUMPRODUCT(N(SRP!AA51<>\"\"))=0,\"\",ROUND(SRP!AA51, 2))","v":""},{"$f":"IF(SUMPRODUCT(N(SRP!AB51<>\"\"))=0,\"\",ROUND(SRP!AB51, 2))","v":""},{"$f":"IF(SUMPRODUCT(N(SRP!AL51<>\"\"))=0,\"\",SRP!AL51)","v":""}]
[null,null,null,null,null,{"$f":"IF(SRP!B52<>\"\",ROW(F35)-2,\"\")","v":""},{"$f":"IF(SUMPRODUCT(N(SRP!$C52<>\"\"))=0,\"\",SRP!C52)","v":""},{"$f":"IF(SUMPRODUCT(N(SRP!$D52<>\"\"))=0,\"\",SRP!D52)","v":""},{"$f":"IF(SUMPRODUCT(N(SRP!$E52:'SRP'!$H52<>\"\"))=0,\"\",SRP!E52)","v":""},{"$f":"IF(SUMPRODUCT(N(SRP!$E52:'SRP'!$H52<>\"\"))=0,\"\",SRP!F52)","v":""},{"$f":"IF(SUMPRODUCT(N(SRP!$E52:'SRP'!$H52<>\"\"))=0,\"\",SRP!G52)","v":""},{"$f":"IF(SUMPRODUCT(N(SRP!$E52:'SRP'!$H52<>\"\"))=0,\"\",SRP!H52)","v":""},{"$f":"IF(SUMPRODUCT(N(SRP!$I52:'SRP'!$L52<>\"\"))=0,\"\",SRP!I52)","v":""},{"$f":"IF(SUMPRODUCT(N(SRP!$I52:'SRP'!$L52<>\"\"))=0,\"\",SRP!J52)","v":""},{"$f":"IF(SUMPRODUCT(N(SRP!$I52:'SRP'!$L52<>\"\"))=0,\"\",SRP!K52)","v":""},{"$f":"IF(SUMPRODUCT(N(SRP!$I52:'SRP'!$L52<>\"\"))=0,\"\",SRP!L52)","v":""},{"$f":"IF(SUMPRODUCT(N(SRP!$M52:'SRP'!$P52<>\"\"))=0,\"\",SRP!M52)","v":""},{"$f":"IF(SUMPRODUCT(N(SRP!$M52:'SRP'!$P52<>\"\"))=0,\"\",SRP!N52)","v":""},{"$f":"IF(SUMPRODUCT(N(SRP!$M52:'SRP'!$P52<>\"\"))=0,\"\",SRP!O52)","v":""},{"$f":"IF(SUMPRODUCT(N(SRP!$M52:'SRP'!$P52<>\"\"))=0,\"\",SRP!P52)","v":""},{"$f":"IF(SUMPRODUCT(N(SRP!$Q52:'SRP'!$X52<>\"\"))=0,\"\",SRP!Q52)","v":""},{"$f":"IF(SUMPRODUCT(N(SRP!$Q52:'SRP'!$X52<>\"\"))=0,\"\",SRP!R52)","v":""},{"$f":"IF(SUMPRODUCT(N(SRP!$Q52:'SRP'!$X52<>\"\"))=0,\"\",SRP!S52)","v":""},{"$f":"IF(SUMPRODUCT(N(SRP!$Q52:'SRP'!$X52<>\"\"))=0,\"\",SRP!T52)","v":""},{"$f":"IF(SUMPRODUCT(N(SRP!$Q52:'SRP'!$X52<>\"\"))=0,\"\",SRP!U52)","v":""},{"$f":"IF(SUMPRODUCT(N(SRP!$Q52:'SRP'!$X52<>\"\"))=0,\"\",SRP!V52)","v":""},{"$f":"IF(SUMPRODUCT(N(SRP!$Q52:'SRP'!$X52<>\"\"))=0,\"\",SRP!W52)","v":""},{"$f":"IF(SUMPRODUCT(N(SRP!$Q52:'SRP'!$X52<>\"\"))=0,\"\",SRP!X52)","v":""},{"$f":"IF(SUMPRODUCT(N(SRP!Y52<>\"\"))=0,\"\",ROUND(SRP!Y52, 2))","v":""},{"$f":"IF(SUMPRODUCT(N(SRP!Z52<>\"\"))=0,\"\",ROUND(SRP!Z52, 2))","v":""},{"$f":"IF(SUMPRODUCT(N(SRP!AA52<>\"\"))=0,\"\",ROUND(SRP!AA52, 2))","v":""},{"$f":"IF(SUMPRODUCT(N(SRP!AB52<>\"\"))=0,\"\",ROUND(SRP!AB52, 2))","v":""},{"$f":"IF(SUMPRODUCT(N(SRP!AL52<>\"\"))=0,\"\",SRP!AL52)","v":""}]
[null,null,null,null,null,{"$f":"IF(SRP!B53<>\"\",ROW(F36)-2,\"\")","v":""},{"$f":"IF(SUMPRODUCT(N(SRP!$C53<>\"\"))=0,\"\",SRP!C53)","v":""},{"$f":"IF(SUMPRODUCT(N(SRP!$D53<>\"\"))=0,\"\",SRP!D53)","v":""},{"$f":"IF(SUMPRODUCT(N(SRP!$E53:'SRP'!$H53<>\"\"))=0,\"\",SRP!E53)","v":""},{"$f":"IF(SUMPRODUCT(N(SRP!$E53:'SRP'!$H53<>\"\"))=0,\"\",SRP!F53)","v":""},{"$f":"IF(SUMPRODUCT(N(SRP!$E53:'SRP'!$H53<>\"\"))=0,\"\",SRP!G53)","v":""},{"$f":"IF(SUMPRODUCT(N(SRP!$E53:'SRP'!$H53<>\"\"))=0,\"\",SRP!H53)","v":""},{"$f":"IF(SUMPRODUCT(N(SRP!$I53:'SRP'!$L53<>\"\"))=0,\"\",SRP!I53)","v":""},{"$f":"IF(SUMPRODUCT(N(SRP!$I53:'SRP'!$L53<>\"\"))=0,\"\",SRP!J53)","v":""},{"$f":"IF(SUMPRODUCT(N(SRP!$I53:'SRP'!$L53<>\"\"))=0,\"\",SRP!K53)","v":""},{"$f":"IF(SUMPRODUCT(N(SRP!$I53:'SRP'!$L53<>\"\"))=0,\"\",SRP!L53)","v":""},{"$f":"IF(SUMPRODUCT(N(SRP!$M53:'SRP'!$P53<>\"\"))=0,\"\",SRP!M53)","v":""},{"$f":"IF(SUMPRODUCT(N(SRP!$M53:'SRP'!$P53<>\"\"))=0,\"\",SRP!N53)","v":""},{"$f":"IF(SUMPRODUCT(N(SRP!$M53:'SRP'!$P53<>\"\"))=0,\"\",SRP!O53)","v":""},{"$f":"IF(SUMPRODUCT(N(SRP!$M53:'SRP'!$P53<>\"\"))=0,\"\",SRP!P53)","v":""},{"$f":"IF(SUMPRODUCT(N(SRP!$Q53:'SRP'!$X53<>\"\"))=0,\"\",SRP!Q53)","v":""},{"$f":"IF(SUMPRODUCT(N(SRP!$Q53:'SRP'!$X53<>\"\"))=0,\"\",SRP!R53)","v":""},{"$f":"IF(SUMPRODUCT(N(SRP!$Q53:'SRP'!$X53<>\"\"))=0,\"\",SRP!S53)","v":""},{"$f":"IF(SUMPRODUCT(N(SRP!$Q53:'SRP'!$X53<>\"\"))=0,\"\",SRP!T53)","v":""},{"$f":"IF(SUMPRODUCT(N(SRP!$Q53:'SRP'!$X53<>\"\"))=0,\"\",SRP!U53)","v":""},{"$f":"IF(SUMPRODUCT(N(SRP!$Q53:'SRP'!$X53<>\"\"))=0,\"\",SRP!V53)","v":""},{"$f":"IF(SUMPRODUCT(N(SRP!$Q53:'SRP'!$X53<>\"\"))=0,\"\",SRP!W53)","v":""},{"$f":"IF(SUMPRODUCT(N(SRP!$Q53:'SRP'!$X53<>\"\"))=0,\"\",SRP!X53)","v":""},{"$f":"IF(SUMPRODUCT(N(SRP!Y53<>\"\"))=0,\"\",ROUND(SRP!Y53, 2))","v":""},{"$f":"IF(SUMPRODUCT(N(SRP!Z53<>\"\"))=0,\"\",ROUND(SRP!Z53, 2))","v":""},{"$f":"IF(SUMPRODUCT(N(SRP!AA53<>\"\"))=0,\"\",ROUND(SRP!AA53, 2))","v":""},{"$f":"IF(SUMPRODUCT(N(SRP!AB53<>\"\"))=0,\"\",ROUND(SRP!AB53, 2))","v":""},{"$f":"IF(SUMPRODUCT(N(SRP!AL53<>\"\"))=0,\"\",SRP!AL53)","v":""}]
[null,null,null,null,null,{"$f":"IF(SRP!B54<>\"\",ROW(F37)-2,\"\")","v":""},{"$f":"IF(SUMPRODUCT(N(SRP!$C54<>\"\"))=0,\"\",SRP!C54)","v":""},{"$f":"IF(SUMPRODUCT(N(SRP!$D54<>\"\"))=0,\"\",SRP!D54)","v":""},{"$f":"IF(SUMPRODUCT(N(SRP!$E54:'SRP'!$H54<>\"\"))=0,\"\",SRP!E54)","v":""},{"$f":"IF(SUMPRODUCT(N(SRP!$E54:'SRP'!$H54<>\"\"))=0,\"\",SRP!F54)","v":""},{"$f":"IF(SUMPRODUCT(N(SRP!$E54:'SRP'!$H54<>\"\"))=0,\"\",SRP!G54)","v":""},{"$f":"IF(SUMPRODUCT(N(SRP!$E54:'SRP'!$H54<>\"\"))=0,\"\",SRP!H54)","v":""},{"$f":"IF(SUMPRODUCT(N(SRP!$I54:'SRP'!$L54<>\"\"))=0,\"\",SRP!I54)","v":""},{"$f":"IF(SUMPRODUCT(N(SRP!$I54:'SRP'!$L54<>\"\"))=0,\"\",SRP!J54)","v":""},{"$f":"IF(SUMPRODUCT(N(SRP!$I54:'SRP'!$L54<>\"\"))=0,\"\",SRP!K54)","v":""},{"$f":"IF(SUMPRODUCT(N(SRP!$I54:'SRP'!$L54<>\"\"))=0,\"\",SRP!L54)","v":""},{"$f":"IF(SUMPRODUCT(N(SRP!$M54:'SRP'!$P54<>\"\"))=0,\"\",SRP!M54)","v":""},{"$f":"IF(SUMPRODUCT(N(SRP!$M54:'SRP'!$P54<>\"\"))=0,\"\",SRP!N54)","v":""},{"$f":"IF(SUMPRODUCT(N(SRP!$M54:'SRP'!$P54<>\"\"))=0,\"\",SRP!O54)","v":""},{"$f":"IF(SUMPRODUCT(N(SRP!$M54:'SRP'!$P54<>\"\"))=0,\"\",SRP!P54)","v":""},{"$f":"IF(SUMPRODUCT(N(SRP!$Q54:'SRP'!$X54<>\"\"))=0,\"\",SRP!Q54)","v":""},{"$f":"IF(SUMPRODUCT(N(SRP!$Q54:'SRP'!$X54<>\"\"))=0,\"\",SRP!R54)","v":""},{"$f":"IF(SUMPRODUCT(N(SRP!$Q54:'SRP'!$X54<>\"\"))=0,\"\",SRP!S54)","v":""},{"$f":"IF(SUMPRODUCT(N(SRP!$Q54:'SRP'!$X54<>\"\"))=0,\"\",SRP!T54)","v":""},{"$f":"IF(SUMPRODUCT(N(SRP!$Q54:'SRP'!$X54<>\"\"))=0,\"\",SRP!U54)","v":""},{"$f":"IF(SUMPRODUCT(N(SRP!$Q54:'SRP'!$X54<>\"\"))=0,\"\",SRP!V54)","v":""},{"$f":"IF(SUMPRODUCT(N(SRP!$Q54:'SRP'!$X54<>\"\"))=0,\"\",SRP!W54)","v":""},{"$f":"IF(SUMPRODUCT(N(SRP!$Q54:'SRP'!$X54<>\"\"))=0,\"\",SRP!X54)","v":""},{"$f":"IF(SUMPRODUCT(N(SRP!Y54<>\"\"))=0,\"\",ROUND(SRP!Y54, 2))","v":""},{"$f":"IF(SUMPRODUCT(N(SRP!Z54<>\"\"))=0,\"\",ROUND(SRP!Z54, 2))","v":""},{"$f":"IF(SUMPRODUCT(N(SRP!AA54<>\"\"))=0,\"\",ROUND(SRP!AA54, 2))","v":""},{"$f":"IF(SUMPRODUCT(N(SRP!AB54<>\"\"))=0,\"\",ROUND(SRP!AB54, 2))","v":""},{"$f":"IF(SUMPRODUCT(N(SRP!AL54<>\"\"))=0,\"\",SRP!AL54)","v":""}]
[null,null,null,null,null,{"$f":"IF(SRP!B55<>\"\",ROW(F38)-2,\"\")","v":""},{"$f":"IF(SUMPRODUCT(N(SRP!$C55<>\"\"))=0,\"\",SRP!C55)","v":""},{"$f":"IF(SUMPRODUCT(N(SRP!$D55<>\"\"))=0,\"\",SRP!D55)","v":""},{"$f":"IF(SUMPRODUCT(N(SRP!$E55:'SRP'!$H55<>\"\"))=0,\"\",SRP!E55)","v":""},{"$f":"IF(SUMPRODUCT(N(SRP!$E55:'SRP'!$H55<>\"\"))=0,\"\",SRP!F55)","v":""},{"$f":"IF(SUMPRODUCT(N(SRP!$E55:'SRP'!$H55<>\"\"))=0,\"\",SRP!G55)","v":""},{"$f":"IF(SUMPRODUCT(N(SRP!$E55:'SRP'!$H55<>\"\"))=0,\"\",SRP!H55)","v":""},{"$f":"IF(SUMPRODUCT(N(SRP!$I55:'SRP'!$L55<>\"\"))=0,\"\",SRP!I55)","v":""},{"$f":"IF(SUMPRODUCT(N(SRP!$I55:'SRP'!$L55<>\"\"))=0,\"\",SRP!J55)","v":""},{"$f":"IF(SUMPRODUCT(N(SRP!$I55:'SRP'!$L55<>\"\"))=0,\"\",SRP!K55)","v":""},{"$f":"IF(SUMPRODUCT(N(SRP!$I55:'SRP'!$L55<>\"\"))=0,\"\",SRP!L55)","v":""},{"$f":"IF(SUMPRODUCT(N(SRP!$M55:'SRP'!$P55<>\"\"))=0,\"\",SRP!M55)","v":""},{"$f":"IF(SUMPRODUCT(N(SRP!$M55:'SRP'!$P55<>\"\"))=0,\"\",SRP!N55)","v":""},{"$f":"IF(SUMPRODUCT(N(SRP!$M55:'SRP'!$P55<>\"\"))=0,\"\",SRP!O55)","v":""},{"$f":"IF(SUMPRODUCT(N(SRP!$M55:'SRP'!$P55<>\"\"))=0,\"\",SRP!P55)","v":""},{"$f":"IF(SUMPRODUCT(N(SRP!$Q55:'SRP'!$X55<>\"\"))=0,\"\",SRP!Q55)","v":""},{"$f":"IF(SUMPRODUCT(N(SRP!$Q55:'SRP'!$X55<>\"\"))=0,\"\",SRP!R55)","v":""},{"$f":"IF(SUMPRODUCT(N(SRP!$Q55:'SRP'!$X55<>\"\"))=0,\"\",SRP!S55)","v":""},{"$f":"IF(SUMPRODUCT(N(SRP!$Q55:'SRP'!$X55<>\"\"))=0,\"\",SRP!T55)","v":""},{"$f":"IF(SUMPRODUCT(N(SRP!$Q55:'SRP'!$X55<>\"\"))=0,\"\",SRP!U55)","v":""},{"$f":"IF(SUMPRODUCT(N(SRP!$Q55:'SRP'!$X55<>\"\"))=0,\"\",SRP!V55)","v":""},{"$f":"IF(SUMPRODUCT(N(SRP!$Q55:'SRP'!$X55<>\"\"))=0,\"\",SRP!W55)","v":""},{"$f":"IF(SUMPRODUCT(N(SRP!$Q55:'SRP'!$X55<>\"\"))=0,\"\",SRP!X55)","v":""},{"$f":"IF(SUMPRODUCT(N(SRP!Y55<>\"\"))=0,\"\",ROUND(SRP!Y55, 2))","v":""},{"$f":"IF(SUMPRODUCT(N(SRP!Z55<>\"\"))=0,\"\",ROUND(SRP!Z55, 2))","v":""},{"$f":"IF(SUMPRODUCT(N(SRP!AA55<>\"\"))=0,\"\",ROUND(SRP!AA55, 2))","v":""},{"$f":"IF(SUMPRODUCT(N(SRP!AB55<>\"\"))=0,\"\",ROUND(SRP!AB55, 2))","v":""},{"$f":"IF(SUMPRODUCT(N(SRP!AL55<>\"\"))=0,\"\",SRP!AL55)","v":""}]